{"text_format":"1","workbook":"xlsx","n_sheets":4,"sheets":["DASHBOARD","Calculations","Data","Drivers"],"not_rendered":{"charts":7,"images":5,"macros":1,"external_links":0,"defined_names":13,"comments":0,"pivot_tables":11},"unopened":[],"bounds":{"document_bytes":16777216,"sheet_cells":100000,"rows_first":2000,"rows_last":500,"rows_between":2000,"halvings":0,"cell_chars":16384,"cell_head_chars":4096},"cells_cut":0,"cells_raw":0,"read":"whole","date_system":"1900"}

{"sheet":"DASHBOARD","index":0,"n_rows":25,"n_cols":19,"rows_kept":25,"cut":false,"hidden":false,"merged":[]}
[]
[null,null,null,null,null,null,"Year:",null,null,null,null,"Region:",null,null,null,null,null,null,"Category:"]
[null,null,"Sales Analysis Dashboard"]
[]
[null,null,null,null,null,null,{"$f":"Drivers!$J$20","v":"Location performance: Condiments 2015"}]
[]
[]
[]
[]
[]
[]
[]
[]
[null,null,"Product Category Performance",null,null,null,null,null,null,{"$f":"Drivers!$J$19","v":"Sales Agents Performance in South Coast location in 2015"},null,null,null,null,null,null,null,null,{"$f":"Drivers!J18","v":"Product Revenue Share (in $ '000) :- South Coast, Condiments for 2015"}]
[null,null,"P12M Trend","Category",{"$f":"selYR-1","v":2014},{"$f":"selYR","v":2015},"Trend"]
[null,null,null,{"$f":"Calculations!S19","v":"Beverages"},{"$f":"Calculations!T19","v":96089.5},{"$f":"Calculations!U19","v":246518.78449012758},{"$f":"Calculations!V19","v":1.5655121994612062}]
[null,null,null,{"$f":"Calculations!S20","v":"Condiments"},{"$f":"Calculations!T20","v":58261},{"$f":"Calculations!U20","v":108130.61691444396},{"$f":"Calculations!V20","v":0.85596912024242577}]
[null,null,null,{"$f":"Calculations!S21","v":"Confections"},{"$f":"Calculations!T21","v":98333.5},{"$f":"Calculations!U21","v":86655.963217620854},{"$f":"Calculations!V21","v":-0.11875441006756748}]
[null,null,null,{"$f":"Calculations!S22","v":"Dairy Products"},{"$f":"Calculations!T22","v":189416.5},{"$f":"Calculations!U22","v":168232.56905305476},{"$f":"Calculations!V22","v":-0.11183783327717089}]
[null,null,null,{"$f":"Calculations!S23","v":"Grains/Cereals"},{"$f":"Calculations!T23","v":46567},{"$f":"Calculations!U23","v":74614.719054885863},{"$f":"Calculations!V23","v":0.602308910921594}]
[null,null,null,{"$f":"Calculations!S24","v":"Meat/Poultry"},{"$f":"Calculations!T24","v":62325},{"$f":"Calculations!U24","v":87254.901619216922},{"$f":"Calculations!V24","v":0.3999984214876362}]
[null,null,null,{"$f":"Calculations!S25","v":"Produce"},{"$f":"Calculations!T25","v":75281.5},{"$f":"Calculations!U25","v":165605.91788191223},{"$f":"Calculations!V25","v":1.1998222389552842}]
[null,null,null,{"$f":"Calculations!S26","v":"Seafood"},{"$f":"Calculations!T26","v":86857},{"$f":"Calculations!U26","v":106663.85539796448},{"$f":"Calculations!V26","v":0.22803982866049344}]
[]
[null,null,"Author: William K. Wonder"]

{"sheet":"Calculations","index":1,"n_rows":121,"n_cols":39,"rows_kept":121,"cut":false,"hidden":false,"merged":[]}
["Year",2015,null,null,null,"Revenue Performance by Location",null,null,null,null,null,"Yearly Trend Analysis",null,null,null,null,null,null,"Product Category and products performance",null,null,null,null,null,null,null,null,null,null,null,null,null,null,null,null,null,null,"Sales Agent Performance"]
["Location","South Coast",null,null,null,"YTDDates","YTD"]
["Category Name","Condiments",null,null,null,"Year",2015,null,null,null,null,null,null,null,null,null,null,null,"YTDDates","YTD",null,null,null,null,null,null,null,null,null,null,null,null,null,null,null,null,null,"Year",2015]
[null,null,null,null,null,"Category Name","Condiments",null,null,null,null,"Location","South Coast",null,null,null,null,null,"Location","South Coast",null,null,null,null,null,null,null,null,null,null,null,null,null,null,null,null,null,"Location","South Coast"]
[]
["YTD Revenue",null,null,null,null,"Row Labels","Revenue","Revenue,%",null,null,null,"Sum of Sales","Column Labels",null,null,null,null,null,"Sum of Sales",null,null,null,null,null,null,null,null,null,null,null,null,null,null,null,null,null,null,"Sales Agents","Revenue"]
[null,null,null,null,null,"East Coast",156161.28988737485,0.36229945528898744,null,null,null,"Row Labels",2014,2015,2016,null,null,null,null,2014,2015,2016,null,null,null,null,null,null,null,null,null,null,null,null,null,null,null,"Jarison. P",177892.02667364498]
["YTDDates","YTD",null,null,null,"South Coast",108130.61691444396,0.25086667532279683,null,null,null,"Jan",120740.5,133889.23741552734,240794.98593750005,null,null,null,"Beverages",96089.5,246518.78449012758,121233.23021799317,null,null,null,null,null,null,null,null,null,null,null,null,null,null,null,"Moodley. L",239313.31931648252]
["Category Name","Condiments",null,null,null,"North Coast",88115.060405731201,0.20442990968361358,null,null,null,"Feb",100624,163340.78414062501,166880.984375,null,null,null,"Condiments",58261,108130.61691444396,129741.45751464844,null,null,null,null,null,null,null,null,null,null,null,null,null,null,null,"Kinsly. N",243234.4709827881]
[null,null,null,null,null,"West Coast",78621.254357986458,0.18240395970460219,null,null,null,"Mar",98065.5,147364.57353515623,198676.82500000001,null,null,null,"Confections",98333.5,86655.963217620854,240004.33493916018,null,null,null,null,null,null,null,null,null,null,null,null,null,null,null,"Lumford. T",265902.58043492428]
["Row Labels","Revenue","YoY%",null,null,"Grand Total",431028.22156553646,1,null,null,null,"Apr",86795.5,126780.39694610596,337714.08645937499,null,null,null,"Dairy Products",189416.5,168232.56905305476,347835.01873908693,null,null,null,null,null,null,null,null,null,null,null,null,null,null,null,"Hannis. H",269169.62160267337]
[2014,274834.5,null,null,null,null,null,null,null,null,null,"May",197580,235086.73723635866,171966.78451538086,null,null,null,"Grains/Cereals",46567,74614.719054885863,81579.056086669923,null,null,null,null,null,null,null,null,null,null,null,null,null,null,null,"Ilknis. K",333632.67267985846]
[2015,431028.22156553663,0.56831919415334187,null,null,null,null,null,null,null,null,"Jun",109325.5,237215.59835545349,189629.5,null,null,null,"Meat/Poultry",62325,87254.901619216922,209665.22200715332,null,null,null,null,null,null,null,null,null,null,null,null,null,null,null,"Franly. S",351830.09818910528]
[2016,648277.25020532229,0.50402506789628754,null,null,null,null,null,null,null,null,"Jul",163361.5,200882.78437500002,null,null,null,null,"Produce",75281.5,165605.91788191223,90858.760715625016,null,null,null,null,null,null,null,null,null,null,null,null,null,null,null,"Grooner. T",523454.91474699101]
["Grand Total",1354139.9717708589,null,null,null,"Region","Revenue, %","Dummy",null,null,null,"Aug",164375,267753.0146484375,null,null,null,null,"Seafood",86857,106663.85539796448,84746.086066918942]
[null,null,null,null,null,{"$f":"$F7","v":"East Coast"},{"$f":"VLOOKUP($F16,$F$7:$H$10,3,FALSE)","v":0.36229945528898744},{"$f":"1-$G16","v":0.63770054471101256},null,null,null,"Sep",119325.5,163345.39101562501]
[null,null,null,null,null,{"$f":"$F8","v":"South Coast"},{"$f":"VLOOKUP($F17,$F$7:$H$10,3,FALSE)","v":0.25086667532279683},{"$f":"1-$G17","v":0.74913332467720317},null,null,null,"Oct",192255,252112.31411132816]
[null,null,null,null,null,{"$f":"$F9","v":"North Coast"},{"$f":"VLOOKUP($F18,$F$7:$H$10,3,FALSE)","v":0.20442990968361358},0.79557009031638648,null,null,null,"Nov",117881,200477.43642106935,null,null,null,"P12M Trend","Category",{"$f":"selYR-1","v":2014},{"$f":"selYR","v":2015},"Trend"]
[null,null,null,null,null,{"$f":"$F10","v":"West Coast"},{"$f":"VLOOKUP($F19,$F$7:$H$10,3,FALSE)","v":0.18240395970460219},0.81759604029539779,null,null,null,"Dec",204423,276181.43642578128,null,null,null,null,"Beverages",{"$f":"IFERROR(VLOOKUP($S19,$S$7:$V$15,MATCH(T$18,$S$7:$V$7,0),FALSE),\"\")","v":96089.5},246518.78449012758,{"$f":"IFERROR(U19/T19-1,\"\")","v":1.5655121994612062}]
["Year","Revenue","YoY%",null,null,null,null,null,null,null,null,null,null,null,null,null,null,null,"Condiments",58261,108130.61691444396,0.85596912024242577]
[{"$f":"selYR","v":2015},{"$f":"IFERROR(VLOOKUP($A21,$A$11:$C$14,MATCH(B$20,$A$11:$C$11,0)),\"\")","v":431028.22156553663},0.56831919415334187,{"$f":"C21","v":0.56831919415334187},{"$f":"D21","v":0.56831919415334187},"Text to appear on charts:",null,null,null,null,null,null,null,null,null,null,null,null,"Confections",98333.5,86655.963217620854,-0.11875441006756748]
[{"$f":"selYR-1","v":2014},274834.5,0,{"$f":"C22","v":0},{"$f":"D22","v":0},{"$f":"$F16&\" (\"&TEXT($G7,\"$#,###\")&\")\"","v":"East Coast ($156,161)"},null,null,null,null,null,null,null,null,null,null,null,null,"Dairy Products",189416.5,168232.56905305476,-0.11183783327717089]
[null,null,null,null,null,{"$f":"$F17&\" (\"&TEXT($G8,\"$#,###\")&\")\"","v":"South Coast ($108,131)"},null,null,null,null,null,null,null,null,null,null,null,null,"Grains/Cereals",46567,74614.719054885863,0.602308910921594]
[null,null,null,null,null,"North Coast ($88,115)",null,null,null,null,null,null,null,null,null,null,null,null,"Meat/Poultry",62325,87254.901619216922,0.3999984214876362]
[null,null,null,null,null,"West Coast ($78,621)",null,null,null,null,null,null,null,null,null,null,null,null,"Produce",75281.5,165605.91788191223,1.1998222389552842]
[null,null,null,null,null,null,null,null,null,null,null,null,null,null,null,null,null,null,"Seafood",86857,106663.85539796448,0.22803982866049344]
[]
[]
[null,null,null,null,null,"YTDDates","YTD",null,null,null,null,null,null,null,null,null,null,null,"P12Months","Past12Months"]
[null,null,null,null,null,"Category Name","Condiments"]
[null,null,null,null,null,null,null,null,null,null,null,null,null,null,null,null,null,null,"Sum of Sales"]
[null,null,null,null,null,"Year","Location","Revenue","YoY%",null,null,null,null,null,null,null,null,null,null,2015,2015,2015,2015,2015,2015,2016,2016,2016,2016,2016,2016]
[null,null,null,null,{"$f":"F33&G33&$G$30","v":"2014East CoastCondiments"},2014,"East Coast",58446.5,null,null,null,null,null,null,null,null,null,null,null,"Jul","Aug","Sep","Oct","Nov","Dec","Jan","Feb","Mar","Apr","May","Jun"]
[null,null,null,null,{"$f":"F34&G34&$G$30","v":"2014North CoastCondiments"},2014,"North Coast",90683.5,null,null,null,"▲",null,null,null,null,null,null,"Beverages",136025.1826171875,99961.269433593741,101289.34511718749,128384.69842529298,86618.099698901366,189977.44746093749,184450.78518750001,187769.21875,144178.10375000001,175970.20263750004,69854.363662719727,238037.5]
[null,null,null,null,"2014South CoastCondiments",2014,"South Coast",58261,null,null,null,"▼",null,null,null,null,null,null,"Condiments",110059.68339843751,73121.903613281262,60769.000195312503,96161.767272949219,82853.91841289062,101218.80234375001,80874.193499999979,126342.28125,81677.485000000001,162796.86281250004,150984.42764282227,45602]
[null,null,null,null,"2014West CoastCondiments",2014,"West Coast",67443.5,null,null,null,null,null,null,null,null,null,null,"Confections",113253.54345703124,130185.96855468748,116800.11738281249,114072.07357177735,113231.33786964111,149211.64248046876,83965.787999999971,208339.484375,289126.91874999995,217949.1208875,135582.26577758789,83879.5]
[null,null,null,null,"2015East CoastCondiments",2015,"East Coast",156161.28988737485,1.6718672612966534,null,null,{"$f":"$F16&\" (\"&TEXT($G7,\"$#,###\")&\")\"","v":"East Coast ($156,161)"},null,null,null,null,null,null,"Dairy Products",220343.2321289063,119532.57011718751,195504.25781250003,195113.12332763674,293113.4613911499,172103.49228515624,218888.92406250001,159682.171875,242911.10499999995,262746.89077500004,190039.61535644531,147341]
[null,null,null,null,"2015North CoastCondiments",2015,"North Coast",88115.060405731201,-2.8323119357642777E-2,null,null,{"$f":"TEXT(VLOOKUP(selYR&$F16&selCateg,$E$33:$I$44,5,FALSE),\"0.0%\")","v":"167.2%"},null,null,null,null,null,null,"Grains/Cereals",77522.189062500009,89791.592871093759,93483.5712890625,48038.369018554688,134514.68593084719,94225.710058593759,124522.2534375,35187.578125,84528.221249999988,123244.12035000001,121371.30052185059,52020.5]
[null,null,null,null,"2015South CoastCondiments",2015,"South Coast",108130.61691444396,0.85596912024242566,null,null,{"$f":"IF(VLOOKUP(selYR&$F16&selCateg,$E$33:$I$44,5,FALSE)>0,$L$34&TEXT(VLOOKUP(selYR&$F16&selCateg,$E$33:$I$44,5,FALSE),\"0.0%\"),$L$35&TEXT(VLOOKUP(selYR&$F16&selCateg,$E$33:$I$44,5,FALSE),\"0.0%\"))","v":"▲167.2%"},null,null,null,null,null,null,"Meat/Poultry",79470.753222656247,80152.4267578125,200920.93505859375,208603.16905517579,22899.563620971679,238495.03945312498,94762.385999999999,102068.546875,133233.86624999999,296553.24289687502,29213.659286499023,164747]
[null,null,null,null,"2015West CoastCondiments",2015,"West Coast",78621.254357986458,0.16573508726543637,null,null,{"$f":"IF(VLOOKUP(selYR&$F17&selCateg,$E$33:$I$44,5,FALSE)>0,$L$34&TEXT(VLOOKUP(selYR&$F17&selCateg,$E$33:$I$44,5,FALSE),\"0.0%\"),$L$35&TEXT(VLOOKUP(selYR&$F17&selCateg,$E$33:$I$44,5,FALSE),\"0.0%\"))","v":"▲85.6%"},null,null,null,null,null,null,"Produce",26820.650390625,72677.05224609375,46822.405957031253,103437.12062988282,70377.801603662112,211622.56171875002,14991.944062499999,10860.65625,63358.112500000003,137724.04231875003,40708.655090332039,43765]
[null,null,null,null,"2016East CoastCondiments",2016,"East Coast",169992.98043823239,8.8573106439074012E-2,null,null,{"$f":"IF(VLOOKUP(selYR&$F18&selCateg,$E$33:$I$44,5,FALSE)>0,$L$34&TEXT(VLOOKUP(selYR&$F18&selCateg,$E$33:$I$44,5,FALSE),\"0.0%\"),$L$35&TEXT(VLOOKUP(selYR&$F18&selCateg,$E$33:$I$44,5,FALSE),\"0.0%\"))","v":"▼-2.8%"},null,null,null,null,null,null,"Seafood",136922.08359374999,145727.69326171876,153323.27841796874,103883.05173339845,183693.95267189943,100532.80986328126,89962.565624999988,87046.546875,27198.048749999998,73535.56498125002,205016.57048034668,48180]
[null,null,null,null,"2016North CoastCondiments",2016,"North Coast",211068.28237177737,1.3953712498170066,null,null,{"$f":"IF(VLOOKUP(selYR&$F19&selCateg,$E$33:$I$44,5,FALSE)>0,$L$34&TEXT(VLOOKUP(selYR&$F19&selCateg,$E$33:$I$44,5,FALSE),\"0.0%\"),$L$35&TEXT(VLOOKUP(selYR&$F19&selCateg,$E$33:$I$44,5,FALSE),\"0.0%\"))","v":"▲16.6%"}]
[null,null,null,null,"2016South CoastCondiments",2016,"South Coast",129741.45751464844,0.19985866368730323]
[null,null,null,null,"2016West CoastCondiments",2016,"West Coast",137474.52988066408,0.74856698742938865,null,null,null,null,null,null,null,null,"Revenue and Units Sold per Product"]
[]
[null,null,null,null,null,null,null,null,null,null,null,null,null,null,null,null,null,null,null,null,null,null,null,null,null,null,null,null,null,null,null,null,"Year",2015]
[null,null,null,null,null,null,null,null,null,null,null,null,null,null,null,null,null,null,"Year",2015,null,null,null,null,null,null,null,null,null,null,null,null,"Location","South Coast"]
[null,null,null,null,null,null,null,null,null,null,null,null,null,null,null,null,null,null,"Location","South Coast",null,null,null,null,null,"Top / Bottom 5 Products",null,null,null,null,null,null,"Category Name","Condiments"]
[]
[null,null,null,null,null,null,null,null,null,null,null,null,null,null,null,null,null,null,"Product","Revenue","Contribution","Units Sold","Rank",null,null,"Product","Revenue","Contribution","Units Sold",null,null,null,"Row Labels","Revenue","Cummulative %"]
[null,null,null,null,null,null,null,null,null,null,null,null,null,null,null,null,null,null,"Alice Mutton",63349.601511840818,2.6347038297666638E-2,362.10757324218747,{"$f":"RANK($T51,$T$51:$T$119,IF(selView=\"Top 5 Products\", 0, 1))","v":10},null,1,{"$f":"INDEX($S$51:$W$119,\n              MATCH($Y51,$W$51:$W$119,0),\n                       MATCH(Z$50,$S$50:$W$50,0))","v":"Côte de Blaye"},{"$f":"INDEX($S$51:$W$119,MATCH($Y51,$W$51:$W$119,0),MATCH(AA$50,$S$50:$W$50,0))","v":183109.25536262515},7.6154963070992135E-2,154.45740646362307,null,null,null,"Gula Malacca",64237.456322479244,0.28558256724170505]
[null,null,null,null,null,null,null,null,null,null,null,null,null,null,null,null,null,null,"Boston Crab Meat",29025.794206466671,1.2071799874463737E-2,377.65510153198238,26,null,2,"Raclette Courdavault",154435.23531532288,6.4229465730758245E-2,709.76580001831064,null,null,null,"Vegie-spread",35322.364332504272,0.44261636130234266]
[null,null,null,null,null,null,null,null,null,null,null,null,null,null,null,null,null,null,"Camembert Pierrot",24890.081835937497,1.0351761079995565E-2,162.68027343750001,31,null,3,"Tarte au sucre",152745.78537940979,6.3526825128430664E-2,689.59722518920898,null,null,null,"Grandma's Boysenberry Spread",28343.07861328125,0.56862211584654632]
[null,null,null,null,null,null,null,null,null,null,null,null,null,null,null,null,null,null,"Carnarvon Tigers",84332.076726269515,3.50736295446702E-2,283.16499104003901,6,null,4,"Manjimup Dried Apples",123592.03060844421,5.1401806578348044E-2,535.86526657104491,null,null,null,"Sirop d'érable",27632.252197265625,0.69146772607043505]
[null,null,null,null,null,null,null,null,null,null,null,null,null,null,null,null,null,null,"Chai",30326.284313964847,1.2612672458509694E-2,347.49514160156252,24,null,5,"Rössle Sauerkraut",112393.97031500243,4.6744544079928937E-2,514.93624244384762,null,null,null,"Original Frankfurter grüne Soße",21210.46696128845,0.78576379496817594]
[null,null,null,null,null,null,null,null,null,null,null,null,null,null,null,null,null,null,"Chang",33971.99153137207,1.4128918581402104E-2,457.79020751953129,22,null,null,null,null,null,null,null,null,null,"Genen Shouyu",16234.406491470338,0.85793762856776523]
[null,null,null,null,null,null,null,null,null,null,null,null,null,null,null,null,null,null,"Chartreuse verte",5339.296142578125,2.2206081268687345E-3,82.77978515625,66,null,null,null,null,null,null,null,null,null,"Chef Anton's Cajun Seasoning",11887.189205493161,0.91078489564432064]
[null,null,null,null,null,null,null,null,null,null,null,null,null,null,null,null,null,null,"Chef Anton's Cajun Seasoning",11887.189205493161,4.943870549686067E-3,120.07261823730467,52,null,null,null,null,null,null,null,null,null,"Louisiana Fiery Hot Pepper Sauce",9429.2023864746079,0.95270461007156693]
[null,null,null,null,null,null,null,null,null,null,null,null,null,null,null,null,null,null,"Chef Anton's Gumbo Mix",5251.8374999999996,2.1842341615954551E-3,54.706640624999999,67,null,null,null,null,null,null,null,null,null,"Louisiana Hot Spiced Okra",5386.5413552856453,0.97665173371036162]
[null,null,null,null,null,null,null,null,null,null,null,null,null,null,null,null,null,null,"Chocolade",11897.925023803709,4.948335566188687E-3,238.34999487304685,51,null,null,null,null,null,null,null,null,null,"Chef Anton's Gumbo Mix",5251.8374999999996,1]
[null,null,null,null,null,null,null,null,null,null,null,null,null,null,null,null,null,null,"Côte de Blaye",183109.25536262515,7.6154963070992135E-2,154.45740646362307,1]
[null,null,null,null,null,null,null,null,null,null,null,null,null,null,null,null,null,null,"Escargots de Bourgogne",10536.067089843751,4.3819401621810142E-3,177.07675781250001,55]
[null,null,null,null,null,null,null,null,null,null,null,null,null,null,null,null,null,null,"Filo Mix",5422.5694572143548,2.2552414182791677E-3,172.14506213378905,64]
[null,null,null,null,null,null,null,null,null,null,null,null,null,null,null,null,null,null,"Fløtemysost",60921.606528808603,2.5337237521058195E-2,702.59522607421877,11]
[null,null,null,null,null,null,null,null,null,null,null,null,null,null,null,null,null,null,"Geitost",3343.5891197204596,1.3905954968394022E-3,303.96264724731452,68]
[null,null,null,null,null,null,null,null,null,null,null,null,null,null,null,null,null,null,"Genen Shouyu",16234.406491470338,6.75187403492521E-3,233.58858261108398,43]
[null,null,null,null,null,null,null,null,null,null,null,null,null,null,null,null,null,null,"Gnocchi di nonna Alice",76604.757799438492,3.1859845040193922E-2,493.02740258789061,8]
[null,null,null,null,null,null,null,null,null,null,null,null,null,null,null,null,null,null,"Gorgonzola Telino",27974.379249755861,1.163451740590675E-2,499.54248660278319,28]
[null,null,null,null,null,null,null,null,null,null,null,null,null,null,null,null,null,null,"Grandma's Boysenberry Spread",28343.07861328125,1.1787859116340603E-2,251.9384765625,27]
[null,null,null,null,null,null,null,null,null,null,null,null,null,null,null,null,null,null,"Gravad lax",8816.1382218933104,3.6666234013536751E-3,81.017340545654292,58]
[null,null,null,null,null,null,null,null,null,null,null,null,null,null,null,null,null,null,"Guaraná Fantástica",5780.4584106445309,2.4040870895589502E-3,320.59171142578123,62]
[null,null,null,null,null,null,null,null,null,null,null,null,null,null,null,null,null,null,"Gula Malacca",64237.456322479244,2.6716296258891315E-2,751.16581512451171,9]
[null,null,null,null,null,null,null,null,null,null,null,null,null,null,null,null,null,null,"Gumbär Gummibärchen",36526.940112304692,1.5191519237190266E-2,300.0317321777344,19]
[null,null,null,null,null,null,null,null,null,null,null,null,null,null,null,null,null,null,"Gustaf's Knäckebröd",13604.677734375,5.6581723758434895E-3,143.96484375,47]
[null,null,null,null,null,null,null,null,null,null,null,null,null,null,null,null,null,null,"Ikura",14811.013146972658,6.1598861128999306E-3,116.79147949218751,46]
[null,null,null,null,null,null,null,null,null,null,null,null,null,null,null,null,null,null,"Inlagd Sill",50500.533382415786,2.1003123229281988E-2,590.64951324462902,13]
[null,null,null,null,null,null,null,null,null,null,null,null,null,null,null,null,null,null,"Ipoh Coffee",22350.541992187504,9.2955689031714497E-3,107.97363281250001,33]
[null,null,null,null,null,null,null,null,null,null,null,null,null,null,null,null,null,null,"Jack's New England Clam Chowder",23788.411789031987,9.8935775677948378E-3,553.21887881469729,32]
[null,null,null,null,null,null,null,null,null,null,null,null,null,null,null,null,null,null,"Konbu",7256.4253541564949,3.0179403208145748E-3,268.75649459838871,61]
[null,null,null,null,null,null,null,null,null,null,null,null,null,null,null,null,null,null,"Lakkalikööri",37771.474571685787,1.5709119921039093E-2,466.31450088500975,17]
[null,null,null,null,null,null,null,null,null,null,null,null,null,null,null,null,null,null,"Laughing Lumberjack Lager",12069.900027465821,5.0198598046936466E-3,171.40814208984375,49]
[null,null,null,null,null,null,null,null,null,null,null,null,null,null,null,null,null,null,"Longlife Tofu",2384.0578124999997,9.9152734967162095E-4,66.223828124999997,69]
[null,null,null,null,null,null,null,null,null,null,null,null,null,null,null,null,null,null,"Louisiana Fiery Hot Pepper Sauce",9429.2023864746079,3.9215961973566834E-3,111.12286376953125,{"$f":"RANK($T83,$T$51:$T$119,IF(selView=\"Top 5 Products\", 0, 1))","v":56}]
[null,null,null,null,null,null,null,null,null,null,null,null,null,null,null,null,null,null,"Louisiana Hot Spiced Okra",5386.5413552856453,2.2402573653624255E-3,70.412305297851574,65]
[null,null,null,null,null,null,null,null,null,null,null,null,null,null,null,null,null,null,"Manjimup Dried Apples",123592.03060844421,5.1401806578348044E-2,535.86526657104491,4]
[null,null,null,null,null,null,null,null,null,null,null,null,null,null,null,null,null,null,"Mascarpone Fabioli",11953.328994140627,4.9713780241280115E-3,83.009229125976574,50]
[null,null,null,null,null,null,null,null,null,null,null,null,null,null,null,null,null,null,"Maxilaku",5768.3833593749996,2.3990650873576395E-3,80.116435546874996,63]
[null,null,null,null,null,null,null,null,null,null,null,null,null,null,null,null,null,null,"Mishi Kobe Niku",8247.8358764648438,3.4302670028551157E-3,18.8953857421875,59]
[null,null,null,null,null,null,null,null,null,null,null,null,null,null,null,null,null,null,"Mozzarella di Giovanni",11001.585870043946,4.5755489748256382E-3,70.297673291015627,53]
[null,null,null,null,null,null,null,null,null,null,null,null,null,null,null,null,null,null,"Nord-Ost Matjeshering",20995.145740283202,8.731860906511648E-3,177.00621503906251,36]
[null,null,null,null,null,null,null,null,null,null,null,null,null,null,null,null,null,null,"NuNuCa Nuß-Nougat-Creme",7981.4109374999998,3.3194611271615141E-3,126.68906249999999,60]
[null,null,null,null,null,null,null,null,null,null,null,null,null,null,null,null,null,null,"Original Frankfurter grüne Soße",21210.46696128845,8.8214127950908567E-3,363.0066786804199,35]
[null,null,null,null,null,null,null,null,null,null,null,null,null,null,null,null,null,null,"Outback Lager",21584.610782775879,8.9770188503510793E-3,314.86910888671878,34]
[null,null,null,null,null,null,null,null,null,null,null,null,null,null,null,null,null,null,"Pâté chinois",37656.185050415042,1.5661171120103509E-2,394.85710079956061,18]
[null,null,null,null,null,null,null,null,null,null,null,null,null,null,null,null,null,null,"Pavlova",20352.974313702394,8.4647824282574596E-3,274.67871339111332,40]
[null,null,null,null,null,null,null,null,null,null,null,null,null,null,null,null,null,null,"Perth Pasties",42130.236848373417,1.7521924956803187E-2,271.36990640258784,15]
[null,null,null,null,null,null,null,null,null,null,null,null,null,null,null,null,null,null,"Queso Cabrales",31028.488810455317,1.2904718632760215E-2,349.87910943603509,23]
[null,null,null,null,null,null,null,null,null,null,null,null,null,null,null,null,null,null,"Queso Manchego La Pastora",29781.842116882326,1.2386239472743907E-2,174.16281939697265,25]
[null,null,null,null,null,null,null,null,null,null,null,null,null,null,null,null,null,null,"Raclette Courdavault",154435.23531532288,6.4229465730758245E-2,709.76580001831064,2]
[null,null,null,null,null,null,null,null,null,null,null,null,null,null,null,null,null,null,"Ravioli Angelo",20808.307356262208,8.6541550024207582E-3,249.09247155761719,38]
[null,null,null,null,null,null,null,null,null,null,null,null,null,null,null,null,null,null,"Rhönbräu Klosterbier",26418.313641357421,1.0987351217016158E-2,783.82109069824207,30]
[null,null,null,null,null,null,null,null,null,null,null,null,null,null,null,null,null,null,"Röd Kaviar",20504.19287109375,8.5276740807355457E-3,320.32177734375,39]
[null,null,null,null,null,null,null,null,null,null,null,null,null,null,null,null,null,null,"Røgede sild",36383.867175750733,1.5132015340578665E-2,880.92492791748055,20]
[null,null,null,null,null,null,null,null,null,null,null,null,null,null,null,null,null,null,"Rössle Sauerkraut",112393.97031500243,4.6744544079928937E-2,514.93624244384762,5]
[null,null,null,null,null,null,null,null,null,null,null,null,null,null,null,null,null,null,"Sasquatch Ale",15363.720050811768,6.389756382251378E-3,243.86857223510742,44]
[null,null,null,null,null,null,null,null,null,null,null,null,null,null,null,null,null,null,"Scottish Longbreads",10702.245708984374,4.4510536899422422E-3,187.07601599121094,54]
[null,null,null,null,null,null,null,null,null,null,null,null,null,null,null,null,null,null,"Sir Rodney's Scones",43487.544705963133,1.8086427988427717E-2,994.59799392700199,14]
[null,null,null,null,null,null,null,null,null,null,null,null,null,null,null,null,null,null,"Sirop d'érable",27632.252197265625,1.1492227094057776E-2,243.8404541015625,29]
[null,null,null,null,null,null,null,null,null,null,null,null,null,null,null,null,null,null,"Spegesild",12079.366615722658,5.0237969496385046E-3,246.78633471679689,48]
[null,null,null,null,null,null,null,null,null,null,null,null,null,null,null,null,null,null,"Steeleye Stout",17011.617008972171,7.0751151411244757E-3,210.01996307373048,42]
[null,null,null,null,null,null,null,null,null,null,null,null,null,null,null,null,null,null,"Tarte au sucre",152745.78537940979,6.3526825128430664E-2,689.59722518920898,3]
[null,null,null,null,null,null,null,null,null,null,null,null,null,null,null,null,null,null,"Teatime Chocolate Biscuits",14901.261108398439,6.1974201531973571E-3,416.09438964843758,45]
[null,null,null,null,null,null,null,null,null,null,null,null,null,null,null,null,null,null,"Thüringer Rostbratwurst",80188.41796875,3.3350285855500782E-2,143.96484375,7]
[null,null,null,null,null,null,null,null,null,null,null,null,null,null,null,null,null,null,"Tofu",40924.674009613038,1.7020532532462104E-2,421.55830535888668,16]
[null,null,null,null,null,null,null,null,null,null,null,null,null,null,null,null,null,null,"Tourtière",18165.547193939208,7.5550335944469874E-3,617.43057330322267,41]
[null,null,null,null,null,null,null,null,null,null,null,null,null,null,null,null,null,null,"Tunnbröd",9075.4284656524669,3.7744619641780506E-3,224.08465347290041,57]
[null,null,null,null,null,null,null,null,null,null,null,null,null,null,null,null,null,null,"Uncle Bob's Organic Dried Pears",60224.993041992188,2.5047516642350019E-2,446.11105957031248,12]
[null,null,null,null,null,null,null,null,null,null,null,null,null,null,null,null,null,null,"Valkoinen suklaa",20869.764598388672,8.679715010271356E-3,285.88718627929688,37]
[null,null,null,null,null,null,null,null,null,null,null,null,null,null,null,null,null,null,"Vegie-spread",35322.364332504272,1.4690537329720631E-2,216.09640420532227,21]
[null,null,null,null,null,null,null,null,null,null,null,null,null,null,null,null,null,null,"Wimmers gute Semmelknödel",31871.327614013673,1.3255254479966151E-2,266.70567041015624]
[null,null,null,null,null,null,null,null,null,null,null,null,null,null,null,null,null,null,"Zaanse koeken",22159.421351394652,9.2160820126106196E-3,546.23208499145505]

{"sheet":"Data","index":2,"n_rows":2663,"n_cols":14,"rows_kept":2663,"cut":false,"hidden":false,"merged":[]}
[]
[]
["Location","Sales Agents","Category Name","Product Name","Date","Quantity","Unit Price","Year","Month","MonthName","YTDDates","P12Months","Weekday","Sales"]
["West Coast","Oddesy. Y","Dairy Products","Fløtemysost",41640,87,177,{"$f":"YEAR(E4)","v":2014},{"$f":"MONTH(E4)","v":1},{"$f":"TEXT(E4,\"mmm\")","v":"Jan"},{"$f":"IF(I4<MONTH(TODAY()),\"YTD\",\"Not YTD\")","v":"YTD"},{"$f":"IF(AND(E4>=EarliestDate,E4<=MostRecentDate),\"Past12Months\",\"NotPTM\")","v":"NotPTM"},{"$f":"TEXT(E4,\"ddd\")","v":"Wed"},{"$f":"F4*G4","v":15399}]
["East Coast","Johnson. A","Grains/Cereals","Gnocchi di nonna Alice",41640,52,62.5,2014,1,"Jan","YTD","NotPTM","Wed",3250]
["South Coast","Grooner. T","Condiments","Louisiana Fiery Hot Pepper Sauce",41640,75,112,2014,1,"Jan","YTD","NotPTM","Wed",8400]
["East Coast","Anderson. P","Confections","Maxilaku",41640,150,32,2014,1,"Jan","YTD","NotPTM","Wed",4800]
["South Coast","Franly. S","Seafood","Nord-Ost Matjeshering",41640,162,157.5,2014,1,"Jan","YTD","NotPTM","Wed",25515]
["North Coast","Naidoo. L","Beverages","Steeleye Stout",41640,125,36,2014,1,"Jan","YTD","NotPTM","Wed",4500]
["West Coast","Numkin. M","Meat/Poultry","Thüringer Rostbratwurst",41640,75,36,2014,1,"Jan","YTD","NotPTM","Wed",2700]
["East Coast","Peters. K","Grains/Cereals","Tunnbröd",41641,100,50,2014,1,"Jan","YTD","NotPTM","Thu",5000]
["South Coast","Hannis. H","Condiments","Vegie-spread",41641,175,45.5,2014,1,"Jan","YTD","NotPTM","Thu",7962.5]
["South Coast","Jarison. P","Confections","Chocolade",41642,25,93.5,2014,1,"Jan","YTD","NotPTM","Fri",2337.5]
["South Coast","Ilknis. K","Confections","Gumbär Gummibärchen",41642,37,77,2014,1,"Jan","YTD","NotPTM","Fri",2849]
["North Coast","Petty. A","Confections","Maxilaku",41642,105,163.5,2014,1,"Jan","YTD","NotPTM","Fri",17167.5]
["East Coast","Bonders. P","Confections","Pavlova",41642,5,66,2014,1,"Jan","YTD","NotPTM","Fri",330]
["East Coast","Newson. L","Grains/Cereals","Singaporean Hokkien Fried Mee",41642,12,68,2014,1,"Jan","YTD","NotPTM","Fri",816]
["North Coast","Oxford. D","Condiments","Aniseed Syrup",41645,15,26.5,2014,1,"Jan","YTD","NotPTM","Mon",397.5]
["East Coast","Lavin. T","Seafood","Boston Crab Meat",41646,25,64.5,2014,1,"Jan","YTD","NotPTM","Tue",1612.5]
["East Coast","Anderson. P","Beverages","Chai",41646,75,75.5,2014,1,"Jan","YTD","NotPTM","Tue",5662.5]
["South Coast","Kinsly. N","Dairy Products","Fløtemysost",41646,100,69.5,2014,1,"Jan","YTD","NotPTM","Tue",6950]
["East Coast","Johnson. A","Dairy Products","Gudbrandsdalsost",41646,60,64.5,2014,1,"Jan","YTD","NotPTM","Tue",3870]
["East Coast","Perks. M","Seafood","Inlagd Sill",41646,37,129.5,2014,1,"Jan","YTD","NotPTM","Tue",4791.5]
["East Coast","Peters. K","Dairy Products","Queso Cabrales",41646,50,32.5,2014,1,"Jan","YTD","NotPTM","Tue",1625]
["North Coast","Altercon. C","Produce","Rössle Sauerkraut",41646,30,36,2014,1,"Jan","YTD","NotPTM","Tue",1080]
["West Coast","Pursly. U","Confections","Sir Rodney's Scones",41646,30,83.5,2014,1,"Jan","YTD","NotPTM","Tue",2505]
["South Coast","Lumford. T","Seafood","Gravad lax",41647,5,140,2014,1,"Jan","YTD","NotPTM","Wed",700]
["West Coast","Rooney. Y","Confections","Tarte au sucre",41647,62,34.5,2014,1,"Jan","YTD","NotPTM","Wed",2139]
["North Coast","Atterson. P","Meat/Poultry","Tourtière",41647,62,198,2014,1,"Jan","YTD","NotPTM","Wed",12276]
["North Coast","Connely. K","Confections","Sir Rodney's Scones",41648,122,9,2014,1,"Jan","YTD","NotPTM","Thu",1098]
["West Coast","Stanly. N","Produce","Tofu",41648,35,64.5,2014,1,"Jan","YTD","NotPTM","Thu",2257.5]
["North Coast","Edford. O","Dairy Products","Geitost",41649,45,32.5,2014,1,"Jan","YTD","NotPTM","Fri",1462.5]
["South Coast","Moodley. L","Condiments","Gula Malacca",41649,50,70,2014,1,"Jan","YTD","NotPTM","Fri",3500]
["West Coast","Toonly. S","Seafood","Jack's New England Clam Chowder",41649,125,9,2014,1,"Jan","YTD","NotPTM","Fri",1125]
["North Coast","Dinnel. M","Dairy Products","Raclette Courdavault",41649,50,83.5,2014,1,"Jan","YTD","NotPTM","Fri",4175]
["North Coast","Oxford. D","Produce","Tofu",41652,100,177,2014,1,"Jan","YTD","NotPTM","Mon",17700]
["East Coast","Bonders. P","Beverages","Chai",41653,87,46.5,2014,1,"Jan","YTD","NotPTM","Tue",4045.5]
["West Coast","Oddesy. Y","Dairy Products","Geitost",41653,90,45,2014,1,"Jan","YTD","NotPTM","Tue",4050]
["West Coast","Numkin. M","Beverages","Lakkalikööri",41653,50,9,2014,1,"Jan","YTD","NotPTM","Tue",450]
["North Coast","Atterson. P","Confections","Tarte au sucre",41653,25,117.5,2014,1,"Jan","YTD","NotPTM","Tue",2937.5]
["North Coast","Altercon. C","Confections","Teatime Chocolate Biscuits",41653,5,43,2014,1,"Jan","YTD","NotPTM","Tue",215]
["South Coast","Franly. S","Meat/Poultry","Alice Mutton",41654,40,102.5,2014,1,"Jan","YTD","NotPTM","Wed",4100]
["West Coast","Pursly. U","Dairy Products","Geitost",41654,5,21.5,2014,1,"Jan","YTD","NotPTM","Wed",107.5]
["East Coast","Perks. M","Beverages","Côte de Blaye",41655,50,54,2014,1,"Jan","YTD","NotPTM","Thu",2700]
["East Coast","Lavin. T","Condiments","Original Frankfurter grüne Soße",41655,10,32.5,2014,1,"Jan","YTD","NotPTM","Thu",325]
["North Coast","Dinnel. M","Meat/Poultry","Perth Pasties",41655,137,34,2014,1,"Jan","YTD","NotPTM","Thu",4658]
["South Coast","Grooner. T","Grains/Cereals","Ravioli Angelo",41655,150,68,2014,1,"Jan","YTD","NotPTM","Thu",10200]
["West Coast","Rooney. Y","Confections","Scottish Longbreads",41655,25,46.5,2014,1,"Jan","YTD","NotPTM","Thu",1162.5]
["North Coast","Connely. K","Seafood","Spegesild",41655,37,36,2014,1,"Jan","YTD","NotPTM","Thu",1332]
["East Coast","Newson. L","Confections","Teatime Chocolate Biscuits",41655,125,948.5,2014,1,"Jan","YTD","NotPTM","Thu",118562.5]
["South Coast","Ilknis. K","Beverages","Chang",41656,75,112,2014,1,"Jan","YTD","NotPTM","Fri",8400]
["North Coast","Edford. O","Produce","Longlife Tofu",41656,50,129.5,2014,1,"Jan","YTD","NotPTM","Fri",6475]
["South Coast","Hannis. H","Condiments","Sirop d'érable",41656,20,54,2014,1,"Jan","YTD","NotPTM","Fri",1080]
["North Coast","Oxford. D","Confections","Zaanse koeken",41656,150,122,2014,1,"Jan","YTD","NotPTM","Fri",18300]
["North Coast","Atterson. P","Dairy Products","Camembert Pierrot",41659,50,64.5,2014,1,"Jan","YTD","NotPTM","Mon",3225]
["North Coast","Altercon. C","Dairy Products","Gudbrandsdalsost",41659,75,45,2014,1,"Jan","YTD","NotPTM","Mon",3375]
["South Coast","Kinsly. N","Confections","Gumbär Gummibärchen",41660,12,136.5,2014,1,"Jan","YTD","NotPTM","Tue",1638]
["West Coast","Stanly. N","Seafood","Konbu",41660,37,117.5,2014,1,"Jan","YTD","NotPTM","Tue",4347.5]
["West Coast","Oddesy. Y","Meat/Poultry","Mishi Kobe Niku",41660,150,64.5,2014,1,"Jan","YTD","NotPTM","Tue",9675]
["West Coast","Toonly. S","Condiments","Original Frankfurter grüne Soße",41660,50,349,2014,1,"Jan","YTD","NotPTM","Tue",17450]
["South Coast","Jarison. P","Beverages","Outback Lager",41660,50,198,2014,1,"Jan","YTD","NotPTM","Tue",9900]
["West Coast","Numkin. M","Meat/Poultry","Perth Pasties",41660,122,948.5,2014,1,"Jan","YTD","NotPTM","Tue",115717]
["East Coast","Johnson. A","Seafood","Röd Kaviar",41660,35,45,2014,1,"Jan","YTD","NotPTM","Tue",1575]
["East Coast","Anderson. P","Confections","Teatime Chocolate Biscuits",41660,5,112,2014,1,"Jan","YTD","NotPTM","Tue",560]
["East Coast","Peters. K","Confections","Gumbär Gummibärchen",41661,25,86,2014,1,"Jan","YTD","NotPTM","Wed",2150]
["West Coast","Pursly. U","Beverages","Côte de Blaye",41662,50,43,2014,1,"Jan","YTD","NotPTM","Thu",2150]
["East Coast","Bonders. P","Dairy Products","Gorgonzola Telino",41662,75,136.5,2014,1,"Jan","YTD","NotPTM","Thu",10237.5]
["South Coast","Lumford. T","Dairy Products","Raclette Courdavault",41662,17,119.5,{"$f":"YEAR(E68)","v":2014},{"$f":"MONTH(E68)","v":1},{"$f":"TEXT(E68,\"mmm\")","v":"Jan"},{"$f":"IF(I68<MONTH(TODAY()),\"YTD\",\"Not YTD\")","v":"YTD"},{"$f":"IF(AND(E68>=EarliestDate,E68<=MostRecentDate),\"Past12Months\",\"NotPTM\")","v":"NotPTM"},{"$f":"TEXT(E68,\"ddd\")","v":"Thu"},{"$f":"F68*G68","v":2031.5}]
["North Coast","Connely. K","Confections","Scottish Longbreads",41662,87,157.5,2014,1,"Jan","YTD","NotPTM","Thu",13702.5]
["West Coast","Rooney. Y","Beverages","Steeleye Stout",41662,100,58.5,2014,1,"Jan","YTD","NotPTM","Thu",5850]
["North Coast","Dinnel. M","Beverages","Lakkalikööri",41663,125,66,2014,1,"Jan","YTD","NotPTM","Fri",8250]
["East Coast","Newson. L","Meat/Poultry","Pâté chinois",41663,100,26.5,2014,1,"Jan","YTD","NotPTM","Fri",2650]
["South Coast","Moodley. L","Grains/Cereals","Gnocchi di nonna Alice",41666,87,83.5,2014,1,"Jan","YTD","NotPTM","Mon",7264.5]
["South Coast","Grooner. T","Produce","Tofu",41666,25,112,2014,1,"Jan","YTD","NotPTM","Mon",2800]
["South Coast","Franly. S","Grains/Cereals","Wimmers gute Semmelknödel",41666,125,36,2014,1,"Jan","YTD","NotPTM","Mon",4500]
["West Coast","Stanly. N","Seafood","Spegesild",41667,75,34,2014,1,"Jan","YTD","NotPTM","Tue",2550]
["West Coast","Toonly. S","Confections","Valkoinen suklaa",41668,237,140,2014,1,"Jan","YTD","NotPTM","Wed",33180]
["North Coast","Edford. O","Condiments","Vegie-spread",41668,175,198,2014,1,"Jan","YTD","NotPTM","Wed",34650]
["West Coast","Oddesy. Y","Meat/Poultry","Alice Mutton",41669,45,64.5,2014,1,"Jan","YTD","NotPTM","Thu",2902.5]
["North Coast","Oxford. D","Seafood","Boston Crab Meat",41669,70,136.5,2014,1,"Jan","YTD","NotPTM","Thu",9555]
["East Coast","Lavin. T","Grains/Cereals","Gnocchi di nonna Alice",41669,30,75.5,2014,1,"Jan","YTD","NotPTM","Thu",2265]
["North Coast","Altercon. C","Dairy Products","Raclette Courdavault",41669,25,68,2014,1,"Jan","YTD","NotPTM","Thu",1700]
["South Coast","Hannis. H","Confections","Sir Rodney's Scones",41669,60,27.5,2014,1,"Jan","YTD","NotPTM","Thu",1650]
["West Coast","Numkin. M","Confections","Zaanse koeken",41669,15,75.5,2014,1,"Jan","YTD","NotPTM","Thu",1132.5]
["South Coast","Ilknis. K","Confections","Gumbär Gummibärchen",41670,75,119.5,2014,1,"Jan","YTD","NotPTM","Fri",8962.5]
["East Coast","Perks. M","Meat/Poultry","Tourtière",41670,37,117.5,2014,1,"Jan","YTD","NotPTM","Fri",4347.5]
["North Coast","Atterson. P","Grains/Cereals","Gnocchi di nonna Alice",41673,12,43,2014,2,"Feb","YTD","NotPTM","Mon",516]
["West Coast","Rooney. Y","Beverages","Lakkalikööri",41673,37,136.5,2014,2,"Feb","YTD","NotPTM","Mon",5050.5]
["West Coast","Pursly. U","Dairy Products","Queso Cabrales",41673,25,125,2014,2,"Feb","YTD","NotPTM","Mon",3125]
["North Coast","Connely. K","Beverages","Chang",41674,37,70,2014,2,"Feb","YTD","NotPTM","Tue",2590]
["East Coast","Anderson. P","Grains/Cereals","Gustaf's Knäckebröd",41674,50,50,2014,2,"Feb","YTD","NotPTM","Tue",2500]
["West Coast","Stanly. N","Dairy Products","Mozzarella di Giovanni",41674,125,157.5,2014,2,"Feb","YTD","NotPTM","Tue",19687.5]
["South Coast","Lumford. T","Grains/Cereals","Gnocchi di nonna Alice",41675,200,26.5,2014,2,"Feb","YTD","NotPTM","Wed",5300]
["East Coast","Johnson. A","Meat/Poultry","Perth Pasties",41675,15,119.5,2014,2,"Feb","YTD","NotPTM","Wed",1792.5]
["South Coast","Jarison. P","Beverages","Rhönbräu Klosterbier",41675,100,136.5,2014,2,"Feb","YTD","NotPTM","Wed",13650]
["North Coast","Dinnel. M","Seafood","Spegesild",41675,40,62.5,2014,2,"Feb","YTD","NotPTM","Wed",2500]
["South Coast","Kinsly. N","Grains/Cereals","Wimmers gute Semmelknödel",41675,37,32.5,2014,2,"Feb","YTD","NotPTM","Wed",1202.5]
["North Coast","Edford. O","Grains/Cereals","Ravioli Angelo",41676,75,36,2014,2,"Feb","YTD","NotPTM","Thu",2700]
["East Coast","Peters. K","Beverages","Sasquatch Ale",41676,112,68,2014,2,"Feb","YTD","NotPTM","Thu",7616]
["South Coast","Moodley. L","Confections","Teatime Chocolate Biscuits",41676,15,75.5,2014,2,"Feb","YTD","NotPTM","Thu",1132.5]
["North Coast","Altercon. C","Produce","Longlife Tofu",41677,20,64.5,2014,2,"Feb","YTD","NotPTM","Fri",1290]
["North Coast","Oxford. D","Confections","Pavlova",41677,60,445.5,2014,2,"Feb","YTD","NotPTM","Fri",26730]
["West Coast","Toonly. S","Dairy Products","Queso Manchego La Pastora",41677,75,75.5,2014,2,"Feb","YTD","NotPTM","Fri",5662.5]
["East Coast","Bonders. P","Grains/Cereals","Wimmers gute Semmelknödel",41677,122,62.5,2014,2,"Feb","YTD","NotPTM","Fri",7625]
["East Coast","Newson. L","Beverages","Chang",41680,225,102.5,2014,2,"Feb","YTD","NotPTM","Mon",23062.5]
["East Coast","Lavin. T","Confections","Pavlova",41680,150,61,2014,2,"Feb","YTD","NotPTM","Mon",9150]
["West Coast","Numkin. M","Confections","Schoggi Schokolade",41680,7,45,2014,2,"Feb","YTD","NotPTM","Mon",315]
["East Coast","Perks. M","Condiments","Sirop d'érable",41680,25,140,2014,2,"Feb","YTD","NotPTM","Mon",3500]
["North Coast","Atterson. P","Meat/Poultry","Thüringer Rostbratwurst",41680,15,64.5,2014,2,"Feb","YTD","NotPTM","Mon",967.5]
["East Coast","Anderson. P","Condiments","Louisiana Hot Spiced Okra",41681,37,112,2014,2,"Feb","YTD","NotPTM","Tue",4144]
["West Coast","Oddesy. Y","Dairy Products","Queso Cabrales",41681,87,75.5,2014,2,"Feb","YTD","NotPTM","Tue",6568.5]
["South Coast","Franly. S","Meat/Poultry","Tourtière",41681,30,163.5,2014,2,"Feb","YTD","NotPTM","Tue",4905]
["East Coast","Johnson. A","Meat/Poultry","Alice Mutton",41682,75,34.5,2014,2,"Feb","YTD","NotPTM","Wed",2587.5]
["East Coast","Peters. K","Confections","Gumbär Gummibärchen",41682,87,177,2014,2,"Feb","YTD","NotPTM","Wed",15399]
["East Coast","Bonders. P","Seafood","Jack's New England Clam Chowder",41682,15,26.5,2014,2,"Feb","YTD","NotPTM","Wed",397.5]
["South Coast","Grooner. T","Dairy Products","Queso Cabrales",41682,37,26.5,2014,2,"Feb","YTD","NotPTM","Wed",980.5]
["South Coast","Hannis. H","Produce","Rössle Sauerkraut",41682,5,77,2014,2,"Feb","YTD","NotPTM","Wed",385]
["North Coast","Connely. K","Beverages","Steeleye Stout",41682,37,25,2014,2,"Feb","YTD","NotPTM","Wed",925]
["North Coast","Dinnel. M","Beverages","Chartreuse verte",41683,50,66,2014,2,"Feb","YTD","NotPTM","Thu",3300]
["South Coast","Ilknis. K","Meat/Poultry","Tourtière",41683,50,16,2014,2,"Feb","YTD","NotPTM","Thu",800]
["North Coast","Edford. O","Grains/Cereals","Filo Mix",41684,300,86,2014,2,"Feb","YTD","NotPTM","Fri",25800]
["South Coast","Jarison. P","Dairy Products","Fløtemysost",41684,130,32.5,2014,2,"Feb","YTD","NotPTM","Fri",4225]
["West Coast","Pursly. U","Dairy Products","Gorgonzola Telino",41684,15,112,2014,2,"Feb","YTD","NotPTM","Fri",1680]
["South Coast","Kinsly. N","Beverages","Guaraná Fantástica",41684,35,111.5,2014,2,"Feb","YTD","NotPTM","Fri",3902.5]
["West Coast","Rooney. Y","Condiments","Louisiana Fiery Hot Pepper Sauce",41684,50,25,2014,2,"Feb","YTD","NotPTM","Fri",1250]
["South Coast","Lumford. T","Confections","Teatime Chocolate Biscuits",41684,87,119.5,2014,2,"Feb","YTD","NotPTM","Fri",10396.5]
["North Coast","Oxford. D","Seafood","Boston Crab Meat",41687,50,9,2014,2,"Feb","YTD","NotPTM","Mon",450]
["West Coast","Stanly. N","Confections","Gumbär Gummibärchen",41687,70,75.5,2014,2,"Feb","YTD","NotPTM","Mon",5285]
["West Coast","Toonly. S","Grains/Cereals","Filo Mix",41688,137,46.5,2014,2,"Feb","YTD","NotPTM","Tue",6370.5]
["South Coast","Moodley. L","Seafood","Ikura",41688,25,43,2014,2,"Feb","YTD","NotPTM","Tue",1075]
["East Coast","Newson. L","Confections","Tarte au sucre",41688,50,111.5,2014,2,"Feb","YTD","NotPTM","Tue",5575]
["East Coast","Perks. M","Seafood","Ikura",41689,37,45.5,{"$f":"YEAR(E132)","v":2014},{"$f":"MONTH(E132)","v":2},{"$f":"TEXT(E132,\"mmm\")","v":"Feb"},{"$f":"IF(I132<MONTH(TODAY()),\"YTD\",\"Not YTD\")","v":"YTD"},{"$f":"IF(AND(E132>=EarliestDate,E132<=MostRecentDate),\"Past12Months\",\"NotPTM\")","v":"NotPTM"},{"$f":"TEXT(E132,\"ddd\")","v":"Wed"},{"$f":"F132*G132","v":1683.5}]
["West Coast","Numkin. M","Condiments","Louisiana Fiery Hot Pepper Sauce",41689,37,163.5,2014,2,"Feb","YTD","NotPTM","Wed",6049.5]
["West Coast","Oddesy. Y","Condiments","Original Frankfurter grüne Soße",41689,50,64.5,2014,2,"Feb","YTD","NotPTM","Wed",3225]
["North Coast","Altercon. C","Meat/Poultry","Pâté chinois",41689,100,36,2014,2,"Feb","YTD","NotPTM","Wed",3600]
["East Coast","Lavin. T","Meat/Poultry","Tourtière",41689,250,69.5,2014,2,"Feb","YTD","NotPTM","Wed",17375]
["South Coast","Franly. S","Grains/Cereals","Wimmers gute Semmelknödel",41689,50,62.5,2014,2,"Feb","YTD","NotPTM","Wed",3125]
["East Coast","Anderson. P","Condiments","Gula Malacca",41690,62,54,2014,2,"Feb","YTD","NotPTM","Thu",3348]
["West Coast","Pursly. U","Produce","Rössle Sauerkraut",41690,75,163.5,2014,2,"Feb","YTD","NotPTM","Thu",12262.5]
["East Coast","Johnson. A","Confections","Chocolade",41691,125,117.5,2014,2,"Feb","YTD","NotPTM","Fri",14687.5]
["North Coast","Atterson. P","Dairy Products","Geitost",41691,75,112,2014,2,"Feb","YTD","NotPTM","Fri",8400]
["East Coast","Peters. K","Beverages","Outback Lager",41691,90,198,2014,2,"Feb","YTD","NotPTM","Fri",17820]
["South Coast","Hannis. H","Confections","Pavlova",41691,75,77,2014,2,"Feb","YTD","NotPTM","Fri",5775]
["South Coast","Grooner. T","Seafood","Spegesild",41691,62,102.5,2014,2,"Feb","YTD","NotPTM","Fri",6355]
["West Coast","Rooney. Y","Beverages","Chartreuse verte",41694,40,108,2014,2,"Feb","YTD","NotPTM","Mon",4320]
["South Coast","Jarison. P","Dairy Products","Fløtemysost",41694,37,136.5,2014,2,"Feb","YTD","NotPTM","Mon",5050.5]
["East Coast","Bonders. P","Meat/Poultry","Perth Pasties",41694,50,165.5,2014,2,"Feb","YTD","NotPTM","Mon",8275]
["South Coast","Ilknis. K","Condiments","Sirop d'érable",41694,52,72,2014,2,"Feb","YTD","NotPTM","Mon",3744]
["South Coast","Kinsly. N","Confections","Maxilaku",41695,125,77,2014,2,"Feb","YTD","NotPTM","Tue",9625]
["East Coast","Newson. L","Dairy Products","Raclette Courdavault",41695,70,93,2014,2,"Feb","YTD","NotPTM","Tue",6510]
["North Coast","Connely. K","Confections","Sir Rodney's Scones",41695,52,45,2014,2,"Feb","YTD","NotPTM","Tue",2340]
["South Coast","Moodley. L","Dairy Products","Fløtemysost",41696,10,27.5,2014,2,"Feb","YTD","NotPTM","Wed",275]
["South Coast","Lumford. T","Grains/Cereals","Gnocchi di nonna Alice",41696,50,43,2014,2,"Feb","YTD","NotPTM","Wed",2150]
["North Coast","Dinnel. M","Confections","Gumbär Gummibärchen",41696,50,122,2014,2,"Feb","YTD","NotPTM","Wed",6100]
["East Coast","Lavin. T","Beverages","Ipoh Coffee",41696,100,36,2014,2,"Feb","YTD","NotPTM","Wed",3600]
["West Coast","Stanly. N","Produce","Rössle Sauerkraut",41696,100,125,2014,2,"Feb","YTD","NotPTM","Wed",12500]
["West Coast","Numkin. M","Dairy Products","Mozzarella di Giovanni",41697,52,32,2014,2,"Feb","YTD","NotPTM","Thu",1664]
["South Coast","Franly. S","Seafood","Spegesild",41697,150,86,2014,2,"Feb","YTD","NotPTM","Thu",12900]
["West Coast","Toonly. S","Produce","Uncle Bob's Organic Dried Pears",41697,2,21.5,2014,2,"Feb","YTD","NotPTM","Thu",43]
["East Coast","Perks. M","Seafood","Nord-Ost Matjeshering",41698,7,165.5,2014,2,"Feb","YTD","NotPTM","Fri",1158.5]
["South Coast","Hannis. H","Meat/Poultry","Pâté chinois",41698,70,16,2014,2,"Feb","YTD","NotPTM","Fri",1120]
["South Coast","Grooner. T","Beverages","Rhönbräu Klosterbier",41698,75,34,2014,2,"Feb","YTD","NotPTM","Fri",2550]
["North Coast","Edford. O","Confections","Scottish Longbreads",41698,125,50,2014,2,"Feb","YTD","NotPTM","Fri",6250]
["East Coast","Anderson. P","Confections","Sir Rodney's Scones",41698,40,79,2014,2,"Feb","YTD","NotPTM","Fri",3160]
["West Coast","Oddesy. Y","Seafood","Konbu",41701,50,66,2014,3,"Mar","YTD","NotPTM","Mon",3300]
["West Coast","Pursly. U","Grains/Cereals","Tunnbröd",41701,62,58.5,2014,3,"Mar","YTD","NotPTM","Mon",3627]
["North Coast","Oxford. D","Dairy Products","Camembert Pierrot",41702,62,16,2014,3,"Mar","YTD","NotPTM","Tue",992]
["East Coast","Peters. K","Condiments","Chef Anton's Cajun Seasoning",41702,75,136.5,2014,3,"Mar","YTD","NotPTM","Tue",10237.5]
["East Coast","Newson. L","Grains/Cereals","Gnocchi di nonna Alice",41702,20,119.5,2014,3,"Mar","YTD","NotPTM","Tue",2390]
["East Coast","Johnson. A","Beverages","Ipoh Coffee",41702,52,32.5,2014,3,"Mar","YTD","NotPTM","Tue",1690]
["North Coast","Altercon. C","Grains/Cereals","Singaporean Hokkien Fried Mee",41702,25,75.5,2014,3,"Mar","YTD","NotPTM","Tue",1887.5]
["East Coast","Bonders. P","Confections","Teatime Chocolate Biscuits",41702,45,445.5,2014,3,"Mar","YTD","NotPTM","Tue",20047.5]
["West Coast","Rooney. Y","Seafood","Boston Crab Meat",41703,12,43,2014,3,"Mar","YTD","NotPTM","Wed",516]
["North Coast","Atterson. P","Beverages","Guaraná Fantástica",41703,30,50,2014,3,"Mar","YTD","NotPTM","Wed",1500]
["South Coast","Ilknis. K","Seafood","Røgede sild",41703,100,68,2014,3,"Mar","YTD","NotPTM","Wed",6800]
["East Coast","Lavin. T","Meat/Poultry","Thüringer Rostbratwurst",41703,50,136.5,2014,3,"Mar","YTD","NotPTM","Wed",6825]
["West Coast","Stanly. N","Confections","Valkoinen suklaa",41703,20,93,2014,3,"Mar","YTD","NotPTM","Wed",1860]
["South Coast","Jarison. P","Beverages","Guaraná Fantástica",41704,45,190.5,2014,3,"Mar","YTD","NotPTM","Thu",8572.5]
["North Coast","Dinnel. M","Confections","NuNuCa Nuß-Nougat-Creme",41704,5,69.5,2014,3,"Mar","YTD","NotPTM","Thu",347.5]
["North Coast","Connely. K","Dairy Products","Queso Cabrales",41704,37,165.5,2014,3,"Mar","YTD","NotPTM","Thu",6123.5]
["West Coast","Toonly. S","Seafood","Spegesild",41704,37,32,2014,3,"Mar","YTD","NotPTM","Thu",1184]
["North Coast","Edford. O","Beverages","Ipoh Coffee",41705,87,62.5,2014,3,"Mar","YTD","NotPTM","Fri",5437.5]
["West Coast","Numkin. M","Seafood","Nord-Ost Matjeshering",41705,25,27.5,2014,3,"Mar","YTD","NotPTM","Fri",687.5]
["South Coast","Kinsly. N","Beverages","Chang",41708,30,83.5,2014,3,"Mar","YTD","NotPTM","Mon",2505]
["North Coast","Oxford. D","Condiments","Gula Malacca",41708,75,108,2014,3,"Mar","YTD","NotPTM","Mon",8100]
["North Coast","Altercon. C","Confections","Pavlova",41708,75,225,2014,3,"Mar","YTD","NotPTM","Mon",16875]
["North Coast","Connely. K","Seafood","Carnarvon Tigers",41709,45,163.5,2014,3,"Mar","YTD","NotPTM","Tue",7357.5]
["East Coast","Anderson. P","Grains/Cereals","Gnocchi di nonna Alice",41709,37,64.5,2014,3,"Mar","YTD","NotPTM","Tue",2386.5]
["West Coast","Oddesy. Y","Grains/Cereals","Tunnbröd",41709,30,9,2014,3,"Mar","YTD","NotPTM","Tue",270]
["North Coast","Atterson. P","Produce","Uncle Bob's Organic Dried Pears",41709,200,16,2014,3,"Mar","YTD","NotPTM","Tue",3200]
["East Coast","Perks. M","Grains/Cereals","Wimmers gute Semmelknödel",41709,30,77,2014,3,"Mar","YTD","NotPTM","Tue",2310]
["North Coast","Dinnel. M","Beverages","Guaraná Fantástica",41710,150,61,2014,3,"Mar","YTD","NotPTM","Wed",9150]
["South Coast","Lumford. T","Produce","Manjimup Dried Apples",41710,52,66,2014,3,"Mar","YTD","NotPTM","Wed",3432]
["South Coast","Franly. S","Seafood","Boston Crab Meat",41711,75,34,2014,3,"Mar","YTD","NotPTM","Thu",2550]
["East Coast","Johnson. A","Dairy Products","Fløtemysost",41711,75,119.5,2014,3,"Mar","YTD","NotPTM","Thu",8962.5]
["West Coast","Rooney. Y","Dairy Products","Geitost",41711,105,64.5,{"$f":"YEAR(E196)","v":2014},{"$f":"MONTH(E196)","v":3},{"$f":"TEXT(E196,\"mmm\")","v":"Mar"},{"$f":"IF(I196<MONTH(TODAY()),\"YTD\",\"Not YTD\")","v":"YTD"},{"$f":"IF(AND(E196>=EarliestDate,E196<=MostRecentDate),\"Past12Months\",\"NotPTM\")","v":"NotPTM"},{"$f":"TEXT(E196,\"ddd\")","v":"Thu"},{"$f":"F196*G196","v":6772.5}]
["West Coast","Pursly. U","Beverages","Rhönbräu Klosterbier",41711,87,45,2014,3,"Mar","YTD","NotPTM","Thu",3915]
["North Coast","Edford. O","Produce","Rössle Sauerkraut",41711,30,54,2014,3,"Mar","YTD","NotPTM","Thu",1620]
["South Coast","Moodley. L","Produce","Tofu",41711,50,64.5,2014,3,"Mar","YTD","NotPTM","Thu",3225]
["West Coast","Stanly. N","Dairy Products","Gorgonzola Telino",41712,5,86,2014,3,"Mar","YTD","NotPTM","Fri",430]
["West Coast","Toonly. S","Beverages","Lakkalikööri",41712,75,948.5,2014,3,"Mar","YTD","NotPTM","Fri",71137.5]
["North Coast","Oxford. D","Condiments","Louisiana Hot Spiced Okra",41712,52,36,2014,3,"Mar","YTD","NotPTM","Fri",1872]
["East Coast","Peters. K","Beverages","Chai",41715,25,66,2014,3,"Mar","YTD","NotPTM","Mon",1650]
["South Coast","Grooner. T","Beverages","Chartreuse verte",41715,7,190.5,2014,3,"Mar","YTD","NotPTM","Mon",1333.5]
["North Coast","Altercon. C","Beverages","Outback Lager",41715,50,111.5,2014,3,"Mar","YTD","NotPTM","Mon",5575]
["West Coast","Numkin. M","Meat/Poultry","Pâté chinois",41715,150,198,2014,3,"Mar","YTD","NotPTM","Mon",29700]
["North Coast","Atterson. P","Confections","Sir Rodney's Scones",41715,70,117.5,2014,3,"Mar","YTD","NotPTM","Mon",8225]
["North Coast","Connely. K","Seafood","Ikura",41716,60,72,2014,3,"Mar","YTD","NotPTM","Tue",4320]
["West Coast","Oddesy. Y","Beverages","Côte de Blaye",41717,30,198,2014,3,"Mar","YTD","NotPTM","Wed",5940]
["North Coast","Dinnel. M","Meat/Poultry","Perth Pasties",41717,100,122,2014,3,"Mar","YTD","NotPTM","Wed",12200]
["West Coast","Pursly. U","Dairy Products","Raclette Courdavault",41717,50,68,2014,3,"Mar","YTD","NotPTM","Wed",3400]
["East Coast","Bonders. P","Grains/Cereals","Wimmers gute Semmelknödel",41717,87,50,2014,3,"Mar","YTD","NotPTM","Wed",4350]
["North Coast","Oxford. D","Dairy Products","Camembert Pierrot",41718,75,46.5,2014,3,"Mar","YTD","NotPTM","Thu",3487.5]
["North Coast","Edford. O","Confections","Maxilaku",41718,35,36,2014,3,"Mar","YTD","NotPTM","Thu",1260]
["West Coast","Rooney. Y","Dairy Products","Raclette Courdavault",41718,75,86,2014,3,"Mar","YTD","NotPTM","Thu",6450]
["South Coast","Hannis. H","Confections","Zaanse koeken",41718,25,66,2014,3,"Mar","YTD","NotPTM","Thu",1650]
["East Coast","Newson. L","Seafood","Boston Crab Meat",41719,50,36,2014,3,"Mar","YTD","NotPTM","Fri",1800]
["South Coast","Jarison. P","Seafood","Boston Crab Meat",41722,40,36,2014,3,"Mar","YTD","NotPTM","Mon",1440]
["South Coast","Ilknis. K","Produce","Manjimup Dried Apples",41722,12,75.5,2014,3,"Mar","YTD","NotPTM","Mon",906]
["North Coast","Atterson. P","Condiments","Original Frankfurter grüne Soße",41722,37,69.5,2014,3,"Mar","YTD","NotPTM","Mon",2571.5]
["East Coast","Lavin. T","Beverages","Sasquatch Ale",41722,150,54,2014,3,"Mar","YTD","NotPTM","Mon",8100]
["North Coast","Altercon. C","Confections","Sir Rodney's Scones",41722,17,46.5,2014,3,"Mar","YTD","NotPTM","Mon",790.5]
["East Coast","Perks. M","Condiments","Aniseed Syrup",41723,12,32.5,2014,3,"Mar","YTD","NotPTM","Tue",390]
["West Coast","Stanly. N","Beverages","Chang",41723,60,26.5,2014,3,"Mar","YTD","NotPTM","Tue",1590]
["East Coast","Anderson. P","Beverages","Outback Lager",41723,62,190.5,2014,3,"Mar","YTD","NotPTM","Tue",11811]
["West Coast","Toonly. S","Meat/Poultry","Pâté chinois",41723,45,62.5,2014,3,"Mar","YTD","NotPTM","Tue",2812.5]
["East Coast","Bonders. P","Confections","Gumbär Gummibärchen",41724,50,45,2014,3,"Mar","YTD","NotPTM","Wed",2250]
["South Coast","Lumford. T","Produce","Longlife Tofu",41724,75,198,2014,3,"Mar","YTD","NotPTM","Wed",14850]
["East Coast","Peters. K","Produce","Manjimup Dried Apples",41724,25,32,2014,3,"Mar","YTD","NotPTM","Wed",800]
["South Coast","Kinsly. N","Dairy Products","Queso Cabrales",41724,50,54,2014,3,"Mar","YTD","NotPTM","Wed",2700]
["East Coast","Johnson. A","Confections","Teatime Chocolate Biscuits",41724,75,112,2014,3,"Mar","YTD","NotPTM","Wed",8400]
["West Coast","Numkin. M","Meat/Poultry","Tourtière",41724,25,129.5,2014,3,"Mar","YTD","NotPTM","Wed",3237.5]
["South Coast","Franly. S","Dairy Products","Raclette Courdavault",41725,90,27.5,2014,3,"Mar","YTD","NotPTM","Thu",2475]
["South Coast","Moodley. L","Seafood","Röd Kaviar",41725,37,75.5,2014,3,"Mar","YTD","NotPTM","Thu",2793.5]
["West Coast","Oddesy. Y","Confections","Pavlova",41726,37,75.5,2014,3,"Mar","YTD","NotPTM","Fri",2793.5]
["South Coast","Grooner. T","Dairy Products","Queso Cabrales",41726,150,198,2014,3,"Mar","YTD","NotPTM","Fri",29700]
["North Coast","Dinnel. M","Condiments","Gula Malacca",41729,50,50,2014,3,"Mar","YTD","NotPTM","Mon",2500]
["North Coast","Connely. K","Condiments","Original Frankfurter grüne Soße",41729,75,45,2014,3,"Mar","YTD","NotPTM","Mon",3375]
["South Coast","Ilknis. K","Dairy Products","Raclette Courdavault",41729,50,205,2014,3,"Mar","YTD","NotPTM","Mon",10250]
["South Coast","Hannis. H","Beverages","Rhönbräu Klosterbier",41729,62,46.5,2014,3,"Mar","YTD","NotPTM","Mon",2883]
["North Coast","Edford. O","Confections","Scottish Longbreads",41729,150,50,2014,3,"Mar","YTD","NotPTM","Mon",7500]
["North Coast","Altercon. C","Confections","NuNuCa Nuß-Nougat-Creme",41730,12,46.5,2014,4,"Apr","YTD","NotPTM","Tue",558]
["North Coast","Oxford. D","Grains/Cereals","Singaporean Hokkien Fried Mee",41730,25,61,2014,4,"Apr","YTD","NotPTM","Tue",1525]
["West Coast","Stanly. N","Grains/Cereals","Gnocchi di nonna Alice",41731,35,136.5,2014,4,"Apr","YTD","NotPTM","Wed",4777.5]
["West Coast","Pursly. U","Dairy Products","Gudbrandsdalsost",41731,75,136.5,2014,4,"Apr","YTD","NotPTM","Wed",10237.5]
["West Coast","Rooney. Y","Condiments","Louisiana Fiery Hot Pepper Sauce",41731,50,34.5,2014,4,"Apr","YTD","NotPTM","Wed",1725]
["North Coast","Atterson. P","Condiments","Louisiana Hot Spiced Okra",41731,62,125,2014,4,"Apr","YTD","NotPTM","Wed",7750]
["West Coast","Toonly. S","Seafood","Jack's New England Clam Chowder",41732,12,82.5,2014,4,"Apr","YTD","NotPTM","Thu",990]
["North Coast","Connely. K","Condiments","Original Frankfurter grüne Soße",41732,50,33.5,2014,4,"Apr","YTD","NotPTM","Thu",1675]
["East Coast","Newson. L","Grains/Cereals","Tunnbröd",41732,35,20,2014,4,"Apr","YTD","NotPTM","Thu",700]
["West Coast","Numkin. M","Grains/Cereals","Gnocchi di nonna Alice",41733,62,90,2014,4,"Apr","YTD","NotPTM","Fri",5580]
["East Coast","Lavin. T","Dairy Products","Gorgonzola Telino",41733,75,63,2014,4,"Apr","YTD","NotPTM","Fri",4725]
["North Coast","Dinnel. M","Dairy Products","Mozzarella di Giovanni",41733,30,45,2014,4,"Apr","YTD","NotPTM","Fri",1350]
["South Coast","Jarison. P","Condiments","Original Frankfurter grüne Soße",41733,20,205,2014,4,"Apr","YTD","NotPTM","Fri",4100]
["West Coast","Oddesy. Y","Seafood","Boston Crab Meat",41736,52,42.5,2014,4,"Apr","YTD","NotPTM","Mon",2210]
["East Coast","Perks. M","Beverages","Guaraná Fantástica",41736,30,69.5,2014,4,"Apr","YTD","NotPTM","Mon",2085]
["East Coast","Anderson. P","Grains/Cereals","Singaporean Hokkien Fried Mee",41736,62,128,2014,4,"Apr","YTD","NotPTM","Mon",7936]
["West Coast","Pursly. U","Confections","Maxilaku",41737,50,94.5,2014,4,"Apr","YTD","NotPTM","Tue",4725]
["South Coast","Kinsly. N","Produce","Rössle Sauerkraut",41737,15,147.5,2014,4,"Apr","YTD","NotPTM","Tue",2212.5]
["East Coast","Johnson. A","Condiments","Genen Shouyu",41738,37,207,{"$f":"YEAR(E260)","v":2014},{"$f":"MONTH(E260)","v":4},{"$f":"TEXT(E260,\"mmm\")","v":"Apr"},{"$f":"IF(I260<MONTH(TODAY()),\"YTD\",\"Not YTD\")","v":"YTD"},{"$f":"IF(AND(E260>=EarliestDate,E260<=MostRecentDate),\"Past12Months\",\"NotPTM\")","v":"NotPTM"},{"$f":"TEXT(E260,\"ddd\")","v":"Wed"},{"$f":"F260*G260","v":7659}]
["South Coast","Lumford. T","Produce","Rössle Sauerkraut",41738,75,63,2014,4,"Apr","YTD","NotPTM","Wed",4725]
["North Coast","Edford. O","Meat/Poultry","Tourtière",41738,7,221.5,2014,4,"Apr","YTD","NotPTM","Wed",1550.5]
["South Coast","Franly. S","Beverages","Laughing Lumberjack Lager",41739,30,85.5,2014,4,"Apr","YTD","NotPTM","Thu",2565]
["South Coast","Moodley. L","Meat/Poultry","Perth Pasties",41739,25,147.5,2014,4,"Apr","YTD","NotPTM","Thu",3687.5]
["West Coast","Rooney. Y","Seafood","Røgede sild",41739,175,104.5,2014,4,"Apr","YTD","NotPTM","Thu",18287.5]
["South Coast","Hannis. H","Beverages","Chang",41740,37,57,2014,4,"Apr","YTD","NotPTM","Fri",2109]
["West Coast","Stanly. N","Condiments","Louisiana Fiery Hot Pepper Sauce",41740,25,27,2014,4,"Apr","YTD","NotPTM","Fri",675]
["South Coast","Grooner. T","Meat/Poultry","Perth Pasties",41740,35,67.5,2014,4,"Apr","YTD","NotPTM","Fri",2362.5]
["North Coast","Oxford. D","Confections","Sir Rodney's Scones",41740,25,81,2014,4,"Apr","YTD","NotPTM","Fri",2025]
["East Coast","Peters. K","Condiments","Sirop d'érable",41740,45,63,2014,4,"Apr","YTD","NotPTM","Fri",2835]
["West Coast","Toonly. S","Produce","Tofu",41740,7,205,2014,4,"Apr","YTD","NotPTM","Fri",1435]
["North Coast","Altercon. C","Confections","Tarte au sucre",41743,90,34.5,2014,4,"Apr","YTD","NotPTM","Mon",3105]
["South Coast","Jarison. P","Confections","Chocolade",41744,87,205,2014,4,"Apr","YTD","NotPTM","Tue",17835]
["East Coast","Bonders. P","Beverages","Ipoh Coffee",41744,25,180,2014,4,"Apr","YTD","NotPTM","Tue",4500]
["East Coast","Newson. L","Confections","NuNuCa Nuß-Nougat-Creme",41744,125,135,2014,4,"Apr","YTD","NotPTM","Tue",16875]
["South Coast","Ilknis. K","Beverages","Outback Lager",41744,25,20,2014,4,"Apr","YTD","NotPTM","Tue",500]
["North Coast","Atterson. P","Beverages","Chartreuse verte",41745,15,42.5,2014,4,"Apr","YTD","NotPTM","Wed",637.5]
["West Coast","Numkin. M","Seafood","Konbu",41745,90,557,2014,4,"Apr","YTD","NotPTM","Wed",50130]
["West Coast","Oddesy. Y","Produce","Rössle Sauerkraut",41746,125,99,2014,4,"Apr","YTD","NotPTM","Thu",12375]
["West Coast","Rooney. Y","Condiments","Chef Anton's Cajun Seasoning",41747,97,364.5,2014,4,"Apr","YTD","NotPTM","Fri",35356.5]
["East Coast","Lavin. T","Condiments","Northwoods Cranberry Sauce",41747,22,54,2014,4,"Apr","YTD","NotPTM","Fri",1188]
["North Coast","Connely. K","Beverages","Rhönbräu Klosterbier",41747,37,128,2014,4,"Apr","YTD","NotPTM","Fri",4736]
["West Coast","Pursly. U","Meat/Poultry","Thüringer Rostbratwurst",41747,30,153,2014,4,"Apr","YTD","NotPTM","Fri",4590]
["East Coast","Perks. M","Produce","Uncle Bob's Organic Dried Pears",41747,175,171,2014,4,"Apr","YTD","NotPTM","Fri",29925]
["West Coast","Stanly. N","Dairy Products","Camembert Pierrot",41750,100,45,2014,4,"Apr","YTD","NotPTM","Mon",4500]
["South Coast","Kinsly. N","Beverages","Guaraná Fantástica",41750,125,34.5,2014,4,"Apr","YTD","NotPTM","Mon",4312.5]
["East Coast","Anderson. P","Seafood","Spegesild",41750,15,31.5,2014,4,"Apr","YTD","NotPTM","Mon",472.5]
["North Coast","Dinnel. M","Confections","Zaanse koeken",41750,97,94.5,2014,4,"Apr","YTD","NotPTM","Mon",9166.5]
["East Coast","Johnson. A","Grains/Cereals","Gnocchi di nonna Alice",41751,50,63,2014,4,"Apr","YTD","NotPTM","Tue",3150]
["North Coast","Oxford. D","Condiments","Louisiana Fiery Hot Pepper Sauce",41751,40,11,2014,4,"Apr","YTD","NotPTM","Tue",440]
["North Coast","Altercon. C","Dairy Products","Mascarpone Fabioli",41751,10,247.5,2014,4,"Apr","YTD","NotPTM","Tue",2475]
["South Coast","Moodley. L","Beverages","Rhönbräu Klosterbier",41751,22,87.5,2014,4,"Apr","YTD","NotPTM","Tue",1925]
["South Coast","Lumford. T","Produce","Rössle Sauerkraut",41751,62,281,2014,4,"Apr","YTD","NotPTM","Tue",17422]
["West Coast","Toonly. S","Confections","Sir Rodney's Marmalade",41751,40,436.5,2014,4,"Apr","YTD","NotPTM","Tue",17460]
["West Coast","Numkin. M","Confections","Sir Rodney's Scones",41751,125,78.5,2014,4,"Apr","YTD","NotPTM","Tue",9812.5]
["North Coast","Edford. O","Condiments","Sirop d'érable",41751,125,144,2014,4,"Apr","YTD","NotPTM","Tue",18000]
["West Coast","Rooney. Y","Dairy Products","Camembert Pierrot",41752,15,67.5,2014,4,"Apr","YTD","NotPTM","Wed",1012.5]
["North Coast","Atterson. P","Dairy Products","Geitost",41752,25,153,2014,4,"Apr","YTD","NotPTM","Wed",3825]
["West Coast","Oddesy. Y","Meat/Poultry","Mishi Kobe Niku",41752,210,153,2014,4,"Apr","YTD","NotPTM","Wed",32130]
["West Coast","Pursly. U","Confections","Pavlova",41752,300,197.5,2014,4,"Apr","YTD","NotPTM","Wed",59250]
["West Coast","Stanly. N","Confections","Schoggi Schokolade",41752,200,43,2014,4,"Apr","YTD","NotPTM","Wed",8600]
["South Coast","Franly. S","Seafood","Carnarvon Tigers",41753,12,147.5,2014,4,"Apr","YTD","NotPTM","Thu",1770]
["East Coast","Peters. K","Grains/Cereals","Filo Mix",41753,12,20,2014,4,"Apr","YTD","NotPTM","Thu",240]
["West Coast","Numkin. M","Seafood","Jack's New England Clam Chowder",41753,25,43,2014,4,"Apr","YTD","NotPTM","Thu",1075]
["West Coast","Toonly. S","Beverages","Outback Lager",41753,37,1185.5,2014,4,"Apr","YTD","NotPTM","Thu",43863.5]
["North Coast","Connely. K","Dairy Products","Raclette Courdavault",41753,20,20,2014,4,"Apr","YTD","NotPTM","Thu",400]
["East Coast","Bonders. P","Grains/Cereals","Singaporean Hokkien Fried Mee",41753,40,139.5,2014,4,"Apr","YTD","NotPTM","Thu",5580]
["West Coast","Oddesy. Y","Beverages","Côte de Blaye",41754,62,175.5,2014,4,"Apr","YTD","NotPTM","Fri",10881]
["East Coast","Newson. L","Beverages","Guaraná Fantástica",41754,100,171,2014,4,"Apr","YTD","NotPTM","Fri",17100]
["South Coast","Grooner. T","Condiments","Gula Malacca",41754,15,56,2014,4,"Apr","YTD","NotPTM","Fri",840]
["North Coast","Dinnel. M","Dairy Products","Camembert Pierrot",41757,62,82.5,2014,4,"Apr","YTD","NotPTM","Mon",5115]
["East Coast","Perks. M","Grains/Cereals","Gnocchi di nonna Alice",41757,60,180,2014,4,"Apr","YTD","NotPTM","Mon",10800]
["East Coast","Lavin. T","Seafood","Ikura",41757,7,81,2014,4,"Apr","YTD","NotPTM","Mon",567]
["North Coast","Edford. O","Beverages","Guaraná Fantástica",41758,15,43,2014,4,"Apr","YTD","NotPTM","Tue",645]
["West Coast","Pursly. U","Seafood","Jack's New England Clam Chowder",41758,150,207,2014,4,"Apr","YTD","NotPTM","Tue",31050]
["South Coast","Hannis. H","Meat/Poultry","Perth Pasties",41758,50,116.5,2014,4,"Apr","YTD","NotPTM","Tue",5825]
["South Coast","Ilknis. K","Confections","Scottish Longbreads",41758,100,81,2014,4,"Apr","YTD","NotPTM","Tue",8100]
["East Coast","Anderson. P","Beverages","Steeleye Stout",41758,5,139.5,2014,4,"Apr","YTD","NotPTM","Tue",697.5]
["North Coast","Oxford. D","Seafood","Boston Crab Meat",41759,37,82.5,2014,4,"Apr","YTD","NotPTM","Wed",3052.5]
["South Coast","Kinsly. N","Beverages","Chai",41759,45,117,2014,4,"Apr","YTD","NotPTM","Wed",5265]
["South Coast","Jarison. P","Seafood","Nord-Ost Matjeshering",41759,37,33.5,2014,4,"Apr","YTD","NotPTM","Wed",1239.5]
["East Coast","Johnson. A","Condiments","Northwoods Cranberry Sauce",41759,25,116.5,2014,4,"Apr","YTD","NotPTM","Wed",2912.5]
["West Coast","Rooney. Y","Meat/Poultry","Alice Mutton",41760,20,81,2014,5,"May","YTD","NotPTM","Thu",1620]
["South Coast","Moodley. L","Seafood","Gravad lax",41760,7,94.5,{"$f":"YEAR(E324)","v":2014},{"$f":"MONTH(E324)","v":5},{"$f":"TEXT(E324,\"mmm\")","v":"May"},{"$f":"IF(I324<MONTH(TODAY()),\"YTD\",\"Not YTD\")","v":"YTD"},{"$f":"IF(AND(E324>=EarliestDate,E324<=MostRecentDate),\"Past12Months\",\"NotPTM\")","v":"NotPTM"},{"$f":"TEXT(E324,\"ddd\")","v":"Thu"},{"$f":"F324*G324","v":661.5}]
["East Coast","Peters. K","Seafood","Ikura",41760,37,364.5,2014,5,"May","YTD","NotPTM","Thu",13486.5]
["West Coast","Stanly. N","Beverages","Ipoh Coffee",41760,75,171,2014,5,"May","YTD","NotPTM","Thu",12825]
["North Coast","Altercon. C","Seafood","Jack's New England Clam Chowder",41760,75,85.5,2014,5,"May","YTD","NotPTM","Thu",6412.5]
["East Coast","Bonders. P","Seafood","Nord-Ost Matjeshering",41760,75,85.5,2014,5,"May","YTD","NotPTM","Thu",6412.5]
["East Coast","Newson. L","Confections","Sir Rodney's Marmalade",41760,125,99,2014,5,"May","YTD","NotPTM","Thu",12375]
["South Coast","Lumford. T","Meat/Poultry","Tourtière",41760,25,27,2014,5,"May","YTD","NotPTM","Thu",675]
["North Coast","Atterson. P","Seafood","Boston Crab Meat",41761,22,156.5,2014,5,"May","YTD","NotPTM","Fri",3443]
["North Coast","Connely. K","Seafood","Inlagd Sill",41761,25,162,2014,5,"May","YTD","NotPTM","Fri",4050]
["West Coast","Toonly. S","Beverages","Chai",41764,50,128,2014,5,"May","YTD","NotPTM","Mon",6400]
["East Coast","Perks. M","Condiments","Chef Anton's Cajun Seasoning",41764,62,207,2014,5,"May","YTD","NotPTM","Mon",12834]
["West Coast","Numkin. M","Grains/Cereals","Gnocchi di nonna Alice",41764,37,116.5,2014,5,"May","YTD","NotPTM","Mon",4310.5]
["East Coast","Lavin. T","Seafood","Inlagd Sill",41764,20,11,2014,5,"May","YTD","NotPTM","Mon",220]
["South Coast","Franly. S","Seafood","Konbu",41764,5,247.5,2014,5,"May","YTD","NotPTM","Mon",1237.5]
["East Coast","Anderson. P","Dairy Products","Geitost",41765,25,116.5,2014,5,"May","YTD","NotPTM","Tue",2912.5]
["North Coast","Dinnel. M","Dairy Products","Mozzarella di Giovanni",41765,35,108,2014,5,"May","YTD","NotPTM","Tue",3780]
["South Coast","Grooner. T","Dairy Products","Queso Cabrales",41765,125,81,2014,5,"May","YTD","NotPTM","Tue",10125]
["North Coast","Edford. O","Dairy Products","Gudbrandsdalsost",41766,50,56,2014,5,"May","YTD","NotPTM","Wed",2800]
["North Coast","Oxford. D","Meat/Poultry","Pâté chinois",41766,100,175.5,2014,5,"May","YTD","NotPTM","Wed",17550]
["North Coast","Altercon. C","Confections","Scottish Longbreads",41766,60,156.5,2014,5,"May","YTD","NotPTM","Wed",9390]
["North Coast","Atterson. P","Meat/Poultry","Alice Mutton",41767,125,99,2014,5,"May","YTD","NotPTM","Thu",12375]
["East Coast","Johnson. A","Beverages","Ipoh Coffee",41767,37,247.5,2014,5,"May","YTD","NotPTM","Thu",9157.5]
["South Coast","Ilknis. K","Beverages","Lakkalikööri",41767,25,82.5,2014,5,"May","YTD","NotPTM","Thu",2062.5]
["South Coast","Hannis. H","Dairy Products","Raclette Courdavault",41767,60,76.5,2014,5,"May","YTD","NotPTM","Thu",4590]
["West Coast","Oddesy. Y","Condiments","Sirop d'érable",41767,25,33.5,2014,5,"May","YTD","NotPTM","Thu",837.5]
["South Coast","Jarison. P","Condiments","Louisiana Hot Spiced Okra",41768,37,171,2014,5,"May","YTD","NotPTM","Fri",6327]
["West Coast","Pursly. U","Seafood","Nord-Ost Matjeshering",41768,60,67.5,2014,5,"May","YTD","NotPTM","Fri",4050]
["South Coast","Kinsly. N","Seafood","Boston Crab Meat",41771,75,11,2014,5,"May","YTD","NotPTM","Mon",825]
["North Coast","Dinnel. M","Condiments","Chef Anton's Cajun Seasoning",41771,25,82.5,2014,5,"May","YTD","NotPTM","Mon",2062.5]
["North Coast","Connely. K","Dairy Products","Mozzarella di Giovanni",41771,12,87.5,2014,5,"May","YTD","NotPTM","Mon",1050]
["East Coast","Peters. K","Seafood","Nord-Ost Matjeshering",41771,50,59.5,2014,5,"May","YTD","NotPTM","Mon",2975]
["West Coast","Stanly. N","Seafood","Röd Kaviar",41771,15,238.5,2014,5,"May","YTD","NotPTM","Mon",3577.5]
["West Coast","Rooney. Y","Meat/Poultry","Tourtière",41771,125,94.5,2014,5,"May","YTD","NotPTM","Mon",11812.5]
["North Coast","Oxford. D","Seafood","Boston Crab Meat",41772,37,45,2014,5,"May","YTD","NotPTM","Tue",1665]
["West Coast","Toonly. S","Dairy Products","Queso Cabrales",41772,22,67.5,2014,5,"May","YTD","NotPTM","Tue",1485]
["East Coast","Bonders. P","Dairy Products","Raclette Courdavault",41772,52,156.5,2014,5,"May","YTD","NotPTM","Tue",8138]
["North Coast","Edford. O","Grains/Cereals","Ravioli Angelo",41772,87,153,2014,5,"May","YTD","NotPTM","Tue",13311]
["North Coast","Altercon. C","Dairy Products","Camembert Pierrot",41773,87,20,2014,5,"May","YTD","NotPTM","Wed",1740]
["East Coast","Newson. L","Seafood","Escargots de Bourgogne",41773,125,56,2014,5,"May","YTD","NotPTM","Wed",7000]
["South Coast","Moodley. L","Dairy Products","Geitost",41773,85,1185.5,2014,5,"May","YTD","NotPTM","Wed",100767.5]
["East Coast","Perks. M","Dairy Products","Gorgonzola Telino",41773,15,90,2014,5,"May","YTD","NotPTM","Wed",1350]
["West Coast","Numkin. M","Produce","Manjimup Dried Apples",41773,17,67.5,2014,5,"May","YTD","NotPTM","Wed",1147.5]
["East Coast","Lavin. T","Dairy Products","Mozzarella di Giovanni",41773,2,156.5,2014,5,"May","YTD","NotPTM","Wed",313]
["South Coast","Lumford. T","Dairy Products","Queso Manchego La Pastora",41773,20,27,2014,5,"May","YTD","NotPTM","Wed",540]
["West Coast","Oddesy. Y","Seafood","Röd Kaviar",41773,37,11,2014,5,"May","YTD","NotPTM","Wed",407]
["East Coast","Anderson. P","Dairy Products","Mozzarella di Giovanni",41774,22,96.5,2014,5,"May","YTD","NotPTM","Thu",2123]
["West Coast","Pursly. U","Beverages","Outback Lager",41774,87,56,2014,5,"May","YTD","NotPTM","Thu",4872]
["West Coast","Rooney. Y","Dairy Products","Geitost",41775,100,140.5,2014,5,"May","YTD","NotPTM","Fri",14050]
["South Coast","Franly. S","Seafood","Konbu",41775,17,205,2014,5,"May","YTD","NotPTM","Fri",3485]
["East Coast","Johnson. A","Confections","Maxilaku",41775,90,94.5,2014,5,"May","YTD","NotPTM","Fri",8505]
["North Coast","Atterson. P","Confections","Sir Rodney's Scones",41775,75,171,2014,5,"May","YTD","NotPTM","Fri",12825]
["East Coast","Newson. L","Condiments","Aniseed Syrup",41778,60,33.5,2014,5,"May","YTD","NotPTM","Mon",2010]
["South Coast","Grooner. T","Beverages","Côte de Blaye",41778,175,40.5,2014,5,"May","YTD","NotPTM","Mon",7087.5]
["East Coast","Peters. K","Dairy Products","Fløtemysost",41778,150,45,2014,5,"May","YTD","NotPTM","Mon",6750]
["North Coast","Connely. K","Beverages","Guaraná Fantástica",41778,20,175.5,2014,5,"May","YTD","NotPTM","Mon",3510]
["West Coast","Toonly. S","Confections","Gumbär Gummibärchen",41778,75,81,2014,5,"May","YTD","NotPTM","Mon",6075]
["East Coast","Bonders. P","Condiments","Louisiana Fiery Hot Pepper Sauce",41778,37,94.5,2014,5,"May","YTD","NotPTM","Mon",3496.5]
["West Coast","Stanly. N","Confections","Scottish Longbreads",41778,25,94.5,2014,5,"May","YTD","NotPTM","Mon",2362.5]
["East Coast","Lavin. T","Dairy Products","Queso Cabrales",41779,17,63,2014,5,"May","YTD","NotPTM","Tue",1071]
["East Coast","Perks. M","Meat/Poultry","Tourtière",41779,25,135,2014,5,"May","YTD","NotPTM","Tue",3375]
["East Coast","Anderson. P","Beverages","Laughing Lumberjack Lager",41780,100,221.5,2014,5,"May","YTD","NotPTM","Wed",22150]
["North Coast","Dinnel. M","Dairy Products","Queso Manchego La Pastora",41780,25,128,2014,5,"May","YTD","NotPTM","Wed",3200]
["South Coast","Hannis. H","Produce","Rössle Sauerkraut",41780,60,144,2014,5,"May","YTD","NotPTM","Wed",8640]
["South Coast","Ilknis. K","Grains/Cereals","Tunnbröd",41780,150,85.5,2014,5,"May","YTD","NotPTM","Wed",12825]
["West Coast","Numkin. M","Dairy Products","Queso Cabrales",41781,35,43,{"$f":"YEAR(E388)","v":2014},{"$f":"MONTH(E388)","v":5},{"$f":"TEXT(E388,\"mmm\")","v":"May"},{"$f":"IF(I388<MONTH(TODAY()),\"YTD\",\"Not YTD\")","v":"YTD"},{"$f":"IF(AND(E388>=EarliestDate,E388<=MostRecentDate),\"Past12Months\",\"NotPTM\")","v":"NotPTM"},{"$f":"TEXT(E388,\"ddd\")","v":"Thu"},{"$f":"F388*G388","v":1505}]
["South Coast","Kinsly. N","Seafood","Inlagd Sill",41782,250,42.5,2014,5,"May","YTD","NotPTM","Fri",10625]
["South Coast","Jarison. P","Dairy Products","Mascarpone Fabioli",41782,25,63,2014,5,"May","YTD","NotPTM","Fri",1575]
["West Coast","Oddesy. Y","Beverages","Steeleye Stout",41782,120,238.5,2014,5,"May","YTD","NotPTM","Fri",28620]
["East Coast","Peters. K","Confections","Tarte au sucre",41782,75,34.5,2014,5,"May","YTD","NotPTM","Fri",2587.5]
["East Coast","Johnson. A","Produce","Uncle Bob's Organic Dried Pears",41782,137,56,2014,5,"May","YTD","NotPTM","Fri",7672]
["West Coast","Pursly. U","Seafood","Jack's New England Clam Chowder",41785,25,41,2014,5,"May","YTD","NotPTM","Mon",1025]
["South Coast","Lumford. T","Beverages","Sasquatch Ale",41785,15,45,2014,5,"May","YTD","NotPTM","Mon",675]
["East Coast","Bonders. P","Dairy Products","Gorgonzola Telino",41786,25,58.5,2014,5,"May","YTD","NotPTM","Tue",1462.5]
["West Coast","Rooney. Y","Produce","Manjimup Dried Apples",41786,50,40.5,2014,5,"May","YTD","NotPTM","Tue",2025]
["South Coast","Moodley. L","Seafood","Røgede sild",41786,50,81,2014,5,"May","YTD","NotPTM","Tue",4050]
["North Coast","Edford. O","Meat/Poultry","Alice Mutton",41787,100,78.5,2014,5,"May","YTD","NotPTM","Wed",7850]
["South Coast","Hannis. H","Condiments","Gula Malacca",41787,75,56,2014,5,"May","YTD","NotPTM","Wed",4200]
["North Coast","Altercon. C","Confections","Pavlova",41787,15,81,2014,5,"May","YTD","NotPTM","Wed",1215]
["South Coast","Franly. S","Confections","Sir Rodney's Scones",41787,100,87.5,2014,5,"May","YTD","NotPTM","Wed",8750]
["North Coast","Oxford. D","Condiments","Sirop d'érable",41787,45,162,2014,5,"May","YTD","NotPTM","Wed",7290]
["South Coast","Grooner. T","Beverages","Steeleye Stout",41787,37,94.5,2014,5,"May","YTD","NotPTM","Wed",3496.5]
["West Coast","Stanly. N","Confections","Teatime Chocolate Biscuits",41787,45,20,2014,5,"May","YTD","NotPTM","Wed",900]
["North Coast","Atterson. P","Dairy Products","Gudbrandsdalsost",41788,50,221.5,2014,5,"May","YTD","NotPTM","Thu",11075]
["East Coast","Newson. L","Beverages","Rhönbräu Klosterbier",41788,50,238.5,2014,5,"May","YTD","NotPTM","Thu",11925]
["South Coast","Jarison. P","Dairy Products","Gorgonzola Telino",41789,62,42.5,2014,5,"May","YTD","NotPTM","Fri",2635]
["North Coast","Edford. O","Grains/Cereals","Gustaf's Knäckebröd",41789,75,104.5,2014,5,"May","YTD","NotPTM","Fri",7837.5]
["East Coast","Lavin. T","Condiments","Original Frankfurter grüne Soße",41789,87,41,2014,5,"May","YTD","NotPTM","Fri",3567]
["North Coast","Oxford. D","Confections","Pavlova",41789,7,67.5,2014,5,"May","YTD","NotPTM","Fri",472.5]
["South Coast","Ilknis. K","Dairy Products","Queso Cabrales",41789,50,34.5,2014,5,"May","YTD","NotPTM","Fri",1725]
["North Coast","Connely. K","Beverages","Steeleye Stout",41789,60,94.5,2014,5,"May","YTD","NotPTM","Fri",5670]
["North Coast","Dinnel. M","Confections","Tarte au sucre",41789,110,78.5,2014,5,"May","YTD","NotPTM","Fri",8635]
["West Coast","Toonly. S","Grains/Cereals","Tunnbröd",41789,100,171,2014,5,"May","YTD","NotPTM","Fri",17100]
["West Coast","Oddesy. Y","Grains/Cereals","Gnocchi di nonna Alice",41792,75,149.5,2014,6,"Jun","YTD","NotPTM","Mon",11212.5]
["West Coast","Numkin. M","Beverages","Guaraná Fantástica",41792,60,156.5,2014,6,"Jun","YTD","NotPTM","Mon",9390]
["East Coast","Perks. M","Produce","Manjimup Dried Apples",41792,45,147.5,2014,6,"Jun","YTD","NotPTM","Mon",6637.5]
["East Coast","Anderson. P","Confections","Teatime Chocolate Biscuits",41792,75,31.5,2014,6,"Jun","YTD","NotPTM","Mon",2362.5]
["North Coast","Altercon. C","Produce","Tofu",41792,50,238.5,2014,6,"Jun","YTD","NotPTM","Mon",11925]
["West Coast","Pursly. U","Dairy Products","Mozzarella di Giovanni",41793,50,116.5,2014,6,"Jun","YTD","NotPTM","Tue",5825]
["South Coast","Kinsly. N","Beverages","Rhönbräu Klosterbier",41793,45,108,2014,6,"Jun","YTD","NotPTM","Tue",4860]
["West Coast","Rooney. Y","Grains/Cereals","Wimmers gute Semmelknödel",41793,15,56,2014,6,"Jun","YTD","NotPTM","Tue",840]
["East Coast","Peters. K","Grains/Cereals","Filo Mix",41794,50,11,2014,6,"Jun","YTD","NotPTM","Wed",550]
["North Coast","Connely. K","Produce","Manjimup Dried Apples",41794,25,221.5,2014,6,"Jun","YTD","NotPTM","Wed",5537.5]
["East Coast","Johnson. A","Meat/Poultry","Perth Pasties",41794,30,43,2014,6,"Jun","YTD","NotPTM","Wed",1290]
["North Coast","Atterson. P","Seafood","Röd Kaviar",41794,37,221.5,2014,6,"Jun","YTD","NotPTM","Wed",8195.5]
["South Coast","Lumford. T","Confections","Zaanse koeken",41794,25,87.5,2014,6,"Jun","YTD","NotPTM","Wed",2187.5]
["East Coast","Bonders. P","Seafood","Jack's New England Clam Chowder",41795,62,20,2014,6,"Jun","YTD","NotPTM","Thu",1240]
["South Coast","Moodley. L","Meat/Poultry","Pâté chinois",41795,125,238.5,2014,6,"Jun","YTD","NotPTM","Thu",29812.5]
["South Coast","Franly. S","Condiments","Gula Malacca",41796,40,175.5,2014,6,"Jun","YTD","NotPTM","Fri",7020]
["South Coast","Grooner. T","Produce","Manjimup Dried Apples",41796,87,94.5,2014,6,"Jun","YTD","NotPTM","Fri",8221.5]
["West Coast","Stanly. N","Seafood","Nord-Ost Matjeshering",41796,62,85.5,2014,6,"Jun","YTD","NotPTM","Fri",5301]
["North Coast","Dinnel. M","Confections","Tarte au sucre",41796,62,108,2014,6,"Jun","YTD","NotPTM","Fri",6696]
["East Coast","Newson. L","Dairy Products","Geitost",41799,100,247.5,2014,6,"Jun","YTD","NotPTM","Mon",24750]
["North Coast","Edford. O","Confections","Tarte au sucre",41799,175,31.5,2014,6,"Jun","YTD","NotPTM","Mon",5512.5]
["South Coast","Hannis. H","Meat/Poultry","Alice Mutton",41800,75,81,2014,6,"Jun","YTD","NotPTM","Tue",6075]
["North Coast","Altercon. C","Grains/Cereals","Filo Mix",41800,150,56,2014,6,"Jun","YTD","NotPTM","Tue",8400]
["West Coast","Toonly. S","Dairy Products","Gorgonzola Telino",41800,7,238.5,2014,6,"Jun","YTD","NotPTM","Tue",1669.5]
["West Coast","Numkin. M","Seafood","Inlagd Sill",41800,25,81,2014,6,"Jun","YTD","NotPTM","Tue",2025]
["North Coast","Oxford. D","Meat/Poultry","Pâté chinois",41800,45,149.5,2014,6,"Jun","YTD","NotPTM","Tue",6727.5]
["East Coast","Lavin. T","Beverages","Guaraná Fantástica",41801,25,144,2014,6,"Jun","YTD","NotPTM","Wed",3600]
["North Coast","Atterson. P","Grains/Cereals","Wimmers gute Semmelknödel",41801,87,56,2014,6,"Jun","YTD","NotPTM","Wed",4872]
["West Coast","Rooney. Y","Seafood","Carnarvon Tigers",41802,37,94.5,2014,6,"Jun","YTD","NotPTM","Thu",3496.5]
["North Coast","Connely. K","Dairy Products","Gorgonzola Telino",41802,125,82.5,2014,6,"Jun","YTD","NotPTM","Thu",10312.5]
["West Coast","Pursly. U","Beverages","Lakkalikööri",41802,12,139.5,2014,6,"Jun","YTD","NotPTM","Thu",1674]
["West Coast","Oddesy. Y","Produce","Manjimup Dried Apples",41802,45,281,2014,6,"Jun","YTD","NotPTM","Thu",12645]
["South Coast","Ilknis. K","Dairy Products","Queso Cabrales",41802,27,104.5,2014,6,"Jun","YTD","NotPTM","Thu",2821.5]
["East Coast","Perks. M","Dairy Products","Raclette Courdavault",41802,37,34.5,2014,6,"Jun","YTD","NotPTM","Thu",1276.5]
["West Coast","Stanly. N","Seafood","Ikura",41803,70,63,2014,6,"Jun","YTD","NotPTM","Fri",4410]
["North Coast","Dinnel. M","Dairy Products","Gorgonzola Telino",41806,5,82.5,2014,6,"Jun","YTD","NotPTM","Mon",412.5]
["South Coast","Jarison. P","Beverages","Lakkalikööri",41806,30,78.5,{"$f":"YEAR(E452)","v":2014},{"$f":"MONTH(E452)","v":6},{"$f":"TEXT(E452,\"mmm\")","v":"Jun"},{"$f":"IF(I452<MONTH(TODAY()),\"YTD\",\"Not YTD\")","v":"YTD"},{"$f":"IF(AND(E452>=EarliestDate,E452<=MostRecentDate),\"Past12Months\",\"NotPTM\")","v":"NotPTM"},{"$f":"TEXT(E452,\"ddd\")","v":"Mon"},{"$f":"F452*G452","v":2355}]
["West Coast","Oddesy. Y","Grains/Cereals","Gnocchi di nonna Alice",41807,50,81,2014,6,"Jun","YTD","NotPTM","Tue",4050]
["West Coast","Toonly. S","Dairy Products","Queso Cabrales",41807,150,171,2014,6,"Jun","YTD","NotPTM","Tue",25650]
["West Coast","Numkin. M","Grains/Cereals","Singaporean Hokkien Fried Mee",41807,25,81,2014,6,"Jun","YTD","NotPTM","Tue",2025]
["South Coast","Kinsly. N","Produce","Tofu",41807,25,221.5,2014,6,"Jun","YTD","NotPTM","Tue",5537.5]
["North Coast","Edford. O","Seafood","Boston Crab Meat",41808,25,81,2014,6,"Jun","YTD","NotPTM","Wed",2025]
["East Coast","Anderson. P","Dairy Products","Mascarpone Fabioli",41808,15,149.5,2014,6,"Jun","YTD","NotPTM","Wed",2242.5]
["South Coast","Lumford. T","Confections","Pavlova",41808,62,147.5,2014,6,"Jun","YTD","NotPTM","Wed",9145]
["East Coast","Johnson. A","Beverages","Rhönbräu Klosterbier",41808,35,11,2014,6,"Jun","YTD","NotPTM","Wed",385]
["East Coast","Newson. L","Meat/Poultry","Alice Mutton",41809,60,153,2014,6,"Jun","YTD","NotPTM","Thu",9180]
["North Coast","Oxford. D","Seafood","Boston Crab Meat",41809,30,247.5,2014,6,"Jun","YTD","NotPTM","Thu",7425]
["East Coast","Bonders. P","Dairy Products","Geitost",41809,25,81,2014,6,"Jun","YTD","NotPTM","Thu",2025]
["South Coast","Franly. S","Meat/Poultry","Perth Pasties",41809,15,197.5,2014,6,"Jun","YTD","NotPTM","Thu",2962.5]
["South Coast","Grooner. T","Beverages","Sasquatch Ale",41809,45,58.5,2014,6,"Jun","YTD","NotPTM","Thu",2632.5]
["South Coast","Moodley. L","Confections","Tarte au sucre",41809,100,63,2014,6,"Jun","YTD","NotPTM","Thu",6300]
["East Coast","Peters. K","Grains/Cereals","Wimmers gute Semmelknödel",41809,45,175.5,2014,6,"Jun","YTD","NotPTM","Thu",7897.5]
["North Coast","Altercon. C","Beverages","Lakkalikööri",41810,75,156.5,2014,6,"Jun","YTD","NotPTM","Fri",11737.5]
["North Coast","Connely. K","Dairy Products","Mozzarella di Giovanni",41810,15,87.5,2014,6,"Jun","YTD","NotPTM","Fri",1312.5]
["North Coast","Atterson. P","Dairy Products","Raclette Courdavault",41810,50,56,2014,6,"Jun","YTD","NotPTM","Fri",2800]
["South Coast","Hannis. H","Condiments","Vegie-spread",41810,50,34.5,2014,6,"Jun","YTD","NotPTM","Fri",1725]
["West Coast","Pursly. U","Beverages","Chai",41813,75,94.5,2014,6,"Jun","YTD","NotPTM","Mon",7087.5]
["East Coast","Lavin. T","Beverages","Chartreuse verte",41813,125,56,2014,6,"Jun","YTD","NotPTM","Mon",7000]
["North Coast","Dinnel. M","Dairy Products","Gorgonzola Telino",41813,52,34.5,2014,6,"Jun","YTD","NotPTM","Mon",1794]
["South Coast","Kinsly. N","Condiments","Gula Malacca",41813,22,43,2014,6,"Jun","YTD","NotPTM","Mon",946]
["South Coast","Ilknis. K","Condiments","Original Frankfurter grüne Soße",41813,52,87.5,2014,6,"Jun","YTD","NotPTM","Mon",4550]
["South Coast","Jarison. P","Beverages","Rhönbräu Klosterbier",41813,25,69.5,2014,6,"Jun","YTD","NotPTM","Mon",1737.5]
["North Coast","Edford. O","Grains/Cereals","Ravioli Angelo",41814,25,162,2014,6,"Jun","YTD","NotPTM","Tue",4050]
["West Coast","Rooney. Y","Beverages","Steeleye Stout",41814,125,34.5,2014,6,"Jun","YTD","NotPTM","Tue",4312.5]
["South Coast","Lumford. T","Condiments","Genen Shouyu",41815,37,104.5,2014,6,"Jun","YTD","NotPTM","Wed",3866.5]
["North Coast","Oxford. D","Beverages","Rhönbräu Klosterbier",41815,37,42.5,2014,6,"Jun","YTD","NotPTM","Wed",1572.5]
["South Coast","Moodley. L","Seafood","Jack's New England Clam Chowder",41816,35,81,2014,6,"Jun","YTD","NotPTM","Thu",2835]
["West Coast","Stanly. N","Condiments","Louisiana Fiery Hot Pepper Sauce",41816,10,87.5,2014,6,"Jun","YTD","NotPTM","Thu",875]
["West Coast","Toonly. S","Beverages","Rhönbräu Klosterbier",41816,25,557,2014,6,"Jun","YTD","NotPTM","Thu",13925]
["South Coast","Franly. S","Produce","Tofu",41816,50,58.5,2014,6,"Jun","YTD","NotPTM","Thu",2925]
["South Coast","Grooner. T","Beverages","Lakkalikööri",41817,10,81,2014,6,"Jun","YTD","NotPTM","Fri",810]
["West Coast","Numkin. M","Grains/Cereals","Ravioli Angelo",41817,15,140.5,2014,6,"Jun","YTD","NotPTM","Fri",2107.5]
["East Coast","Perks. M","Dairy Products","Camembert Pierrot",41820,10,31.5,2014,6,"Jun","YTD","NotPTM","Mon",315]
["East Coast","Anderson. P","Dairy Products","Gorgonzola Telino",41820,50,81,2014,6,"Jun","YTD","NotPTM","Mon",4050]
["North Coast","Altercon. C","Dairy Products","Gudbrandsdalsost",41820,100,281,2014,6,"Jun","YTD","NotPTM","Mon",28100]
["West Coast","Oddesy. Y","Meat/Poultry","Thüringer Rostbratwurst",41820,50,162,2014,6,"Jun","YTD","NotPTM","Mon",8100]
["North Coast","Atterson. P","Confections","Zaanse koeken",41821,250,63,2014,7,"Jul","YTD","NotPTM","Tue",15750]
["East Coast","Johnson. A","Grains/Cereals","Filo Mix",41822,25,135,2014,7,"Jul","YTD","NotPTM","Wed",3375]
["West Coast","Pursly. U","Confections","Gumbär Gummibärchen",41822,52,364.5,2014,7,"Jul","YTD","NotPTM","Wed",18954]
["South Coast","Hannis. H","Condiments","Original Frankfurter grüne Soße",41822,125,33.5,2014,7,"Jul","YTD","NotPTM","Wed",4187.5]
["East Coast","Peters. K","Beverages","Steeleye Stout",41822,150,58.5,2014,7,"Jul","YTD","NotPTM","Wed",8775]
["North Coast","Connely. K","Seafood","Carnarvon Tigers",41823,35,45,2014,7,"Jul","YTD","NotPTM","Thu",1575]
["North Coast","Dinnel. M","Grains/Cereals","Singaporean Hokkien Fried Mee",41823,50,81,2014,7,"Jul","YTD","NotPTM","Thu",4050]
["South Coast","Ilknis. K","Beverages","Steeleye Stout",41824,60,31.5,2014,7,"Jul","YTD","NotPTM","Fri",1890]
["North Coast","Edford. O","Condiments","Aniseed Syrup",41827,62,69.5,2014,7,"Jul","YTD","NotPTM","Mon",4309]
["North Coast","Oxford. D","Beverages","Chai",41827,10,81,2014,7,"Jul","YTD","NotPTM","Mon",810]
["East Coast","Newson. L","Condiments","Original Frankfurter grüne Soße",41827,75,59.5,2014,7,"Jul","YTD","NotPTM","Mon",4462.5]
["South Coast","Jarison. P","Meat/Poultry","Tourtière",41827,75,81,2014,7,"Jul","YTD","NotPTM","Mon",6075]
["East Coast","Bonders. P","Produce","Uncle Bob's Organic Dried Pears",41827,12,140.5,2014,7,"Jul","YTD","NotPTM","Mon",1686]
["North Coast","Altercon. C","Condiments","Genen Shouyu",41828,162,162,2014,7,"Jul","YTD","NotPTM","Tue",26244]
["East Coast","Lavin. T","Confections","Gumbär Gummibärchen",41828,300,128,2014,7,"Jul","YTD","NotPTM","Tue",38400]
["East Coast","Perks. M","Seafood","Escargots de Bourgogne",41829,50,87.5,2014,7,"Jul","YTD","NotPTM","Wed",4375]
["South Coast","Kinsly. N","Grains/Cereals","Filo Mix",41829,12,171,2014,7,"Jul","YTD","NotPTM","Wed",2052]
["West Coast","Rooney. Y","Dairy Products","Gudbrandsdalsost",41829,30,94.5,2014,7,"Jul","YTD","NotPTM","Wed",2835]
["North Coast","Atterson. P","Beverages","Lakkalikööri",41829,60,197.5,2014,7,"Jul","YTD","NotPTM","Wed",11850]
["West Coast","Stanly. N","Confections","Sir Rodney's Marmalade",41829,87,20,2014,7,"Jul","YTD","NotPTM","Wed",1740]
["North Coast","Connely. K","Dairy Products","Gudbrandsdalsost",41830,75,34.5,2014,7,"Jul","YTD","NotPTM","Thu",2587.5]
["East Coast","Anderson. P","Condiments","Sirop d'érable",41830,87,247.5,2014,7,"Jul","YTD","NotPTM","Thu",21532.5]
["South Coast","Lumford. T","Beverages","Steeleye Stout",41830,25,221.5,2014,7,"Jul","YTD","NotPTM","Thu",5537.5]
["South Coast","Moodley. L","Grains/Cereals","Gnocchi di nonna Alice",41831,150,27,2014,7,"Jul","YTD","NotPTM","Fri",4050]
["West Coast","Numkin. M","Beverages","Guaraná Fantástica",41831,75,67.5,{"$f":"YEAR(E516)","v":2014},{"$f":"MONTH(E516)","v":7},{"$f":"TEXT(E516,\"mmm\")","v":"Jul"},{"$f":"IF(I516<MONTH(TODAY()),\"YTD\",\"Not YTD\")","v":"YTD"},{"$f":"IF(AND(E516>=EarliestDate,E516<=MostRecentDate),\"Past12Months\",\"NotPTM\")","v":"NotPTM"},{"$f":"TEXT(E516,\"ddd\")","v":"Fri"},{"$f":"F516*G516","v":5062.5}]
["West Coast","Toonly. S","Condiments","Louisiana Fiery Hot Pepper Sauce",41831,10,33.5,2014,7,"Jul","YTD","NotPTM","Fri",335]
["East Coast","Johnson. A","Grains/Cereals","Ravioli Angelo",41831,15,57,2014,7,"Jul","YTD","NotPTM","Fri",855]
["North Coast","Edford. O","Beverages","Rhönbräu Klosterbier",41831,125,197.5,2014,7,"Jul","YTD","NotPTM","Fri",24687.5]
["North Coast","Dinnel. M","Condiments","Vegie-spread",41831,22,96.5,2014,7,"Jul","YTD","NotPTM","Fri",2123]
["North Coast","Oxford. D","Dairy Products","Fløtemysost",41834,12,58.5,2014,7,"Jul","YTD","NotPTM","Mon",702]
["North Coast","Altercon. C","Confections","Schoggi Schokolade",41834,25,81,2014,7,"Jul","YTD","NotPTM","Mon",2025]
["South Coast","Franly. S","Confections","Tarte au sucre",41835,50,247.5,2014,7,"Jul","YTD","NotPTM","Tue",12375]
["South Coast","Grooner. T","Seafood","Konbu",41836,112,135,2014,7,"Jul","YTD","NotPTM","Wed",15120]
["East Coast","Peters. K","Dairy Products","Raclette Courdavault",41836,120,94.5,2014,7,"Jul","YTD","NotPTM","Wed",11340]
["West Coast","Pursly. U","Seafood","Röd Kaviar",41836,37,96.5,2014,7,"Jul","YTD","NotPTM","Wed",3570.5]
["West Coast","Oddesy. Y","Meat/Poultry","Tourtière",41836,62,90,2014,7,"Jul","YTD","NotPTM","Wed",5580]
["North Coast","Atterson. P","Condiments","Original Frankfurter grüne Soße",41837,50,99,2014,7,"Jul","YTD","NotPTM","Thu",4950]
["East Coast","Bonders. P","Confections","Chocolade",41838,75,78.5,2014,7,"Jul","YTD","NotPTM","Fri",5887.5]
["East Coast","Newson. L","Grains/Cereals","Gustaf's Knäckebröd",41838,30,156.5,2014,7,"Jul","YTD","NotPTM","Fri",4695]
["North Coast","Connely. K","Beverages","Lakkalikööri",41838,15,81,2014,7,"Jul","YTD","NotPTM","Fri",1215]
["West Coast","Rooney. Y","Confections","Maxilaku",41838,175,153,2014,7,"Jul","YTD","NotPTM","Fri",26775]
["West Coast","Toonly. S","Dairy Products","Camembert Pierrot",41841,35,11,2014,7,"Jul","YTD","NotPTM","Mon",385]
["West Coast","Stanly. N","Dairy Products","Fløtemysost",41841,25,221.5,2014,7,"Jul","YTD","NotPTM","Mon",5537.5]
["East Coast","Lavin. T","Confections","Pavlova",41841,105,82.5,2014,7,"Jul","YTD","NotPTM","Mon",8662.5]
["South Coast","Hannis. H","Dairy Products","Raclette Courdavault",41841,15,45,2014,7,"Jul","YTD","NotPTM","Mon",675]
["West Coast","Rooney. Y","Meat/Poultry","Alice Mutton",41842,12,81,2014,7,"Jul","YTD","NotPTM","Tue",972]
["East Coast","Anderson. P","Seafood","Boston Crab Meat",41842,7,81,2014,7,"Jul","YTD","NotPTM","Tue",567]
["North Coast","Dinnel. M","Condiments","Chef Anton's Cajun Seasoning",41842,45,90,2014,7,"Jul","YTD","NotPTM","Tue",4050]
["West Coast","Oddesy. Y","Dairy Products","Geitost",41842,250,175.5,2014,7,"Jul","YTD","NotPTM","Tue",43875]
["East Coast","Perks. M","Dairy Products","Mozzarella di Giovanni",41842,70,171,2014,7,"Jul","YTD","NotPTM","Tue",11970]
["West Coast","Pursly. U","Meat/Poultry","Pâté chinois",41842,100,153,2014,7,"Jul","YTD","NotPTM","Tue",15300]
["West Coast","Numkin. M","Confections","Tarte au sucre",41842,50,108,2014,7,"Jul","YTD","NotPTM","Tue",5400]
["South Coast","Ilknis. K","Produce","Uncle Bob's Organic Dried Pears",41842,25,85.5,2014,7,"Jul","YTD","NotPTM","Tue",2137.5]
["East Coast","Johnson. A","Grains/Cereals","Gnocchi di nonna Alice",41843,25,139.5,2014,7,"Jul","YTD","NotPTM","Wed",3487.5]
["East Coast","Peters. K","Beverages","Chai",41844,37,153,2014,7,"Jul","YTD","NotPTM","Thu",5661]
["East Coast","Bonders. P","Seafood","Ikura",41844,52,85.5,2014,7,"Jul","YTD","NotPTM","Thu",4446]
["South Coast","Jarison. P","Confections","Sir Rodney's Scones",41844,137,85.5,2014,7,"Jul","YTD","NotPTM","Thu",11713.5]
["East Coast","Newson. L","Dairy Products","Camembert Pierrot",41845,175,139.5,2014,7,"Jul","YTD","NotPTM","Fri",24412.5]
["North Coast","Edford. O","Beverages","Chai",41845,37,67.5,2014,7,"Jul","YTD","NotPTM","Fri",2497.5]
["South Coast","Kinsly. N","Beverages","Chang",41845,35,171,2014,7,"Jul","YTD","NotPTM","Fri",5985]
["East Coast","Lavin. T","Seafood","Inlagd Sill",41845,200,81,2014,7,"Jul","YTD","NotPTM","Fri",16200]
["West Coast","Stanly. N","Dairy Products","Camembert Pierrot",41848,20,45,2014,7,"Jul","YTD","NotPTM","Mon",900]
["East Coast","Perks. M","Seafood","Ikura",41848,20,27,2014,7,"Jul","YTD","NotPTM","Mon",540]
["South Coast","Lumford. T","Seafood","Inlagd Sill",41848,37,1185.5,2014,7,"Jul","YTD","NotPTM","Mon",43863.5]
["East Coast","Anderson. P","Beverages","Lakkalikööri",41848,35,94.5,2014,7,"Jul","YTD","NotPTM","Mon",3307.5]
["North Coast","Oxford. D","Confections","Maxilaku",41848,12,41,2014,7,"Jul","YTD","NotPTM","Mon",492]
["West Coast","Toonly. S","Beverages","Chartreuse verte",41849,37,96.5,2014,7,"Jul","YTD","NotPTM","Tue",3570.5]
["East Coast","Johnson. A","Seafood","Konbu",41849,100,34.5,2014,7,"Jul","YTD","NotPTM","Tue",3450]
["East Coast","Peters. K","Dairy Products","Queso Cabrales",41849,12,108,2014,7,"Jul","YTD","NotPTM","Tue",1296]
["East Coast","Bonders. P","Beverages","Rhönbräu Klosterbier",41849,37,56,2014,7,"Jul","YTD","NotPTM","Tue",2072]
["West Coast","Numkin. M","Confections","Sir Rodney's Scones",41849,12,31.5,2014,7,"Jul","YTD","NotPTM","Tue",378]
["East Coast","Newson. L","Meat/Poultry","Pâté chinois",41850,50,171,2014,7,"Jul","YTD","NotPTM","Wed",8550]
["South Coast","Franly. S","Beverages","Côte de Blaye",41851,175,112.5,2014,7,"Jul","YTD","NotPTM","Thu",19687.5]
["West Coast","Oddesy. Y","Dairy Products","Fløtemysost",41851,45,56,2014,7,"Jul","YTD","NotPTM","Thu",2520]
["South Coast","Moodley. L","Grains/Cereals","Gnocchi di nonna Alice",41851,75,247.5,2014,7,"Jul","YTD","NotPTM","Thu",18562.5]
["North Coast","Altercon. C","Beverages","Outback Lager",41851,25,40.5,2014,7,"Jul","YTD","NotPTM","Thu",1012.5]
["South Coast","Grooner. T","Dairy Products","Raclette Courdavault",41851,100,94.5,2014,7,"Jul","YTD","NotPTM","Thu",9450]
["East Coast","Perks. M","Grains/Cereals","Gnocchi di nonna Alice",41852,62,45,2014,8,"Aug","YTD","NotPTM","Fri",2790]
["South Coast","Hannis. H","Condiments","Grandma's Boysenberry Spread",41852,105,45,2014,8,"Aug","YTD","NotPTM","Fri",4725]
["East Coast","Lavin. T","Confections","Scottish Longbreads",41852,25,205,2014,8,"Aug","YTD","NotPTM","Fri",5125]
["South Coast","Ilknis. K","Grains/Cereals","Gustaf's Knäckebröd",41855,12,20,2014,8,"Aug","YTD","NotPTM","Mon",240]
["South Coast","Jarison. P","Confections","Sir Rodney's Scones",41855,37,96.5,2014,8,"Aug","YTD","NotPTM","Mon",3570.5]
["West Coast","Pursly. U","Grains/Cereals","Filo Mix",41856,15,557,2014,8,"Aug","YTD","NotPTM","Tue",8355]
["South Coast","Lumford. T","Dairy Products","Fløtemysost",41856,7,20,2014,8,"Aug","YTD","NotPTM","Tue",140]
["South Coast","Kinsly. N","Beverages","Guaraná Fantástica",41856,50,67.5,2014,8,"Aug","YTD","NotPTM","Tue",3375]
["South Coast","Moodley. L","Beverages","Outback Lager",41856,52,104.5,2014,8,"Aug","YTD","NotPTM","Tue",5434]
["North Coast","Atterson. P","Confections","Teatime Chocolate Biscuits",41856,50,85.5,2014,8,"Aug","YTD","NotPTM","Tue",4275]
["North Coast","Connely. K","Grains/Cereals","Tunnbröd",41856,37,41,2014,8,"Aug","YTD","NotPTM","Tue",1517]
["North Coast","Dinnel. M","Beverages","Chang",41857,75,81,{"$f":"YEAR(E580)","v":2014},{"$f":"MONTH(E580)","v":8},{"$f":"TEXT(E580,\"mmm\")","v":"Aug"},{"$f":"IF(I580<MONTH(TODAY()),\"YTD\",\"Not YTD\")","v":"YTD"},{"$f":"IF(AND(E580>=EarliestDate,E580<=MostRecentDate),\"Past12Months\",\"NotPTM\")","v":"NotPTM"},{"$f":"TEXT(E580,\"ddd\")","v":"Wed"},{"$f":"F580*G580","v":6075}]
["West Coast","Rooney. Y","Confections","Scottish Longbreads",41857,25,87.5,2014,8,"Aug","YTD","NotPTM","Wed",2187.5]
["South Coast","Franly. S","Beverages","Guaraná Fantástica",41858,25,153,2014,8,"Aug","YTD","NotPTM","Thu",3825]
["West Coast","Toonly. S","Condiments","Gula Malacca",41858,50,153,2014,8,"Aug","YTD","NotPTM","Thu",7650]
["East Coast","Anderson. P","Produce","Rössle Sauerkraut",41858,12,63,2014,8,"Aug","YTD","NotPTM","Thu",756]
["East Coast","Johnson. A","Confections","Sir Rodney's Scones",41858,50,96.5,2014,8,"Aug","YTD","NotPTM","Thu",4825]
["North Coast","Oxford. D","Beverages","Steeleye Stout",41858,30,108,2014,8,"Aug","YTD","NotPTM","Thu",3240]
["North Coast","Edford. O","Confections","Teatime Chocolate Biscuits",41858,7,104.5,2014,8,"Aug","YTD","NotPTM","Thu",731.5]
["West Coast","Stanly. N","Meat/Poultry","Thüringer Rostbratwurst",41858,37,221.5,2014,8,"Aug","YTD","NotPTM","Thu",8195.5]
["South Coast","Grooner. T","Produce","Tofu",41858,30,147.5,2014,8,"Aug","YTD","NotPTM","Thu",4425]
["South Coast","Hannis. H","Dairy Products","Camembert Pierrot",41859,87,67.5,2014,8,"Aug","YTD","NotPTM","Fri",5872.5]
["East Coast","Peters. K","Grains/Cereals","Singaporean Hokkien Fried Mee",41859,37,238.5,2014,8,"Aug","YTD","NotPTM","Fri",8824.5]
["North Coast","Altercon. C","Produce","Tofu",41859,87,81,2014,8,"Aug","YTD","NotPTM","Fri",7047]
["West Coast","Oddesy. Y","Dairy Products","Camembert Pierrot",41862,75,85.5,2014,8,"Aug","YTD","NotPTM","Mon",6412.5]
["East Coast","Bonders. P","Dairy Products","Fløtemysost",41862,87,135,2014,8,"Aug","YTD","NotPTM","Mon",11745]
["South Coast","Ilknis. K","Meat/Poultry","Perth Pasties",41862,50,557,2014,8,"Aug","YTD","NotPTM","Mon",27850]
["South Coast","Jarison. P","Seafood","Röd Kaviar",41862,62,81,2014,8,"Aug","YTD","NotPTM","Mon",5022]
["West Coast","Numkin. M","Confections","Tarte au sucre",41862,22,149.5,2014,8,"Aug","YTD","NotPTM","Mon",3289]
["South Coast","Lumford. T","Beverages","Chai",41863,90,171,2014,8,"Aug","YTD","NotPTM","Tue",15390]
["South Coast","Kinsly. N","Meat/Poultry","Thüringer Rostbratwurst",41863,20,34.5,2014,8,"Aug","YTD","NotPTM","Tue",690]
["West Coast","Pursly. U","Grains/Cereals","Wimmers gute Semmelknödel",41863,5,34.5,2014,8,"Aug","YTD","NotPTM","Tue",172.5]
["North Coast","Connely. K","Beverages","Lakkalikööri",41864,32,27,2014,8,"Aug","YTD","NotPTM","Wed",864]
["North Coast","Atterson. P","Meat/Poultry","Pâté chinois",41864,50,11,2014,8,"Aug","YTD","NotPTM","Wed",550]
["West Coast","Rooney. Y","Beverages","Chang",41865,87,140.5,2014,8,"Aug","YTD","NotPTM","Thu",12223.5]
["North Coast","Dinnel. M","Dairy Products","Geitost",41865,25,99,2014,8,"Aug","YTD","NotPTM","Thu",2475]
["South Coast","Moodley. L","Beverages","Rhönbräu Klosterbier",41865,200,221.5,2014,8,"Aug","YTD","NotPTM","Thu",44300]
["West Coast","Numkin. M","Seafood","Carnarvon Tigers",41866,62,73,2014,8,"Aug","YTD","NotPTM","Fri",4526]
["West Coast","Toonly. S","Confections","Gumbär Gummibärchen",41866,25,94.5,2014,8,"Aug","YTD","NotPTM","Fri",2362.5]
["North Coast","Edford. O","Seafood","Konbu",41866,100,94.5,2014,8,"Aug","YTD","NotPTM","Fri",9450]
["East Coast","Newson. L","Produce","Manjimup Dried Apples",41866,15,59.5,2014,8,"Aug","YTD","NotPTM","Fri",892.5]
["South Coast","Franly. S","Dairy Products","Queso Manchego La Pastora",41866,37,96,2014,8,"Aug","YTD","NotPTM","Fri",3552]
["West Coast","Stanly. N","Beverages","Rhönbräu Klosterbier",41866,125,281,2014,8,"Aug","YTD","NotPTM","Fri",35125]
["South Coast","Grooner. T","Confections","Tarte au sucre",41866,50,128,2014,8,"Aug","YTD","NotPTM","Fri",6400]
["East Coast","Lavin. T","Produce","Uncle Bob's Organic Dried Pears",41866,50,162,2014,8,"Aug","YTD","NotPTM","Fri",8100]
["North Coast","Oxford. D","Condiments","Chef Anton's Cajun Seasoning",41869,62,99,2014,8,"Aug","YTD","NotPTM","Mon",6138]
["South Coast","Hannis. H","Condiments","Chef Anton's Gumbo Mix",41869,37,81,2014,8,"Aug","YTD","NotPTM","Mon",2997]
["North Coast","Altercon. C","Grains/Cereals","Gustaf's Knäckebröd",41869,150,171,2014,8,"Aug","YTD","NotPTM","Mon",25650]
["North Coast","Atterson. P","Condiments","Chef Anton's Cajun Seasoning",41870,20,281,2014,8,"Aug","YTD","NotPTM","Tue",5620]
["East Coast","Perks. M","Seafood","Escargots de Bourgogne",41870,75,45,2014,8,"Aug","YTD","NotPTM","Tue",3375]
["North Coast","Connely. K","Grains/Cereals","Gnocchi di nonna Alice",41870,52,94.5,2014,8,"Aug","YTD","NotPTM","Tue",4914]
["West Coast","Oddesy. Y","Dairy Products","Queso Cabrales",41870,50,42.5,2014,8,"Aug","YTD","NotPTM","Tue",2125]
["West Coast","Pursly. U","Confections","Valkoinen suklaa",41870,150,156.5,2014,8,"Aug","YTD","NotPTM","Tue",23475]
["North Coast","Dinnel. M","Seafood","Carnarvon Tigers",41871,37,67.5,2014,8,"Aug","YTD","NotPTM","Wed",2497.5]
["North Coast","Edford. O","Condiments","Louisiana Fiery Hot Pepper Sauce",41871,50,207,2014,8,"Aug","YTD","NotPTM","Wed",10350]
["West Coast","Stanly. N","Dairy Products","Mozzarella di Giovanni",41871,52,81,2014,8,"Aug","YTD","NotPTM","Wed",4212]
["West Coast","Rooney. Y","Seafood","Røgede sild",41871,37,205,2014,8,"Aug","YTD","NotPTM","Wed",7585]
["East Coast","Anderson. P","Dairy Products","Gudbrandsdalsost",41872,125,85.5,2014,8,"Aug","YTD","NotPTM","Thu",10687.5]
["North Coast","Oxford. D","Beverages","Outback Lager",41872,75,96.5,2014,8,"Aug","YTD","NotPTM","Thu",7237.5]
["East Coast","Bonders. P","Seafood","Boston Crab Meat",41873,37,85.5,2014,8,"Aug","YTD","NotPTM","Fri",3163.5]
["East Coast","Peters. K","Beverages","Chang",41873,10,281,2014,8,"Aug","YTD","NotPTM","Fri",2810]
["East Coast","Johnson. A","Confections","Sir Rodney's Scones",41873,150,82.5,2014,8,"Aug","YTD","NotPTM","Fri",12375]
["South Coast","Ilknis. K","Condiments","Sirop d'érable",41873,75,41,2014,8,"Aug","YTD","NotPTM","Fri",3075]
["East Coast","Newson. L","Seafood","Carnarvon Tigers",41876,45,139.5,2014,8,"Aug","YTD","NotPTM","Mon",6277.5]
["West Coast","Numkin. M","Beverages","Chartreuse verte",41876,50,281,2014,8,"Aug","YTD","NotPTM","Mon",14050]
["North Coast","Altercon. C","Beverages","Ipoh Coffee",41876,37,20,2014,8,"Aug","YTD","NotPTM","Mon",740]
["West Coast","Toonly. S","Produce","Rössle Sauerkraut",41876,57,54,2014,8,"Aug","YTD","NotPTM","Mon",3078]
["West Coast","Oddesy. Y","Seafood","Spegesild",41876,37,156.5,2014,8,"Aug","YTD","NotPTM","Mon",5790.5]
["West Coast","Pursly. U","Seafood","Carnarvon Tigers",41877,75,33.5,2014,8,"Aug","YTD","NotPTM","Tue",2512.5]
["East Coast","Lavin. T","Seafood","Inlagd Sill",41877,50,81,2014,8,"Aug","YTD","NotPTM","Tue",4050]
["South Coast","Jarison. P","Beverages","Chai",41878,87,58.5,2014,8,"Aug","YTD","NotPTM","Wed",5089.5]
["East Coast","Anderson. P","Beverages","Chartreuse verte",41878,62,147.5,2014,8,"Aug","YTD","NotPTM","Wed",9145]
["North Coast","Atterson. P","Dairy Products","Fløtemysost",41878,50,94.5,2014,8,"Aug","YTD","NotPTM","Wed",4725]
["East Coast","Perks. M","Seafood","Ikura",41878,37,94.5,2014,8,"Aug","YTD","NotPTM","Wed",3496.5]
["South Coast","Lumford. T","Condiments","Original Frankfurter grüne Soße",41878,15,33.5,2014,8,"Aug","YTD","NotPTM","Wed",502.5]
["South Coast","Kinsly. N","Confections","Teatime Chocolate Biscuits",41878,50,205,{"$f":"YEAR(E644)","v":2014},{"$f":"MONTH(E644)","v":8},{"$f":"TEXT(E644,\"mmm\")","v":"Aug"},{"$f":"IF(I644<MONTH(TODAY()),\"YTD\",\"Not YTD\")","v":"YTD"},{"$f":"IF(AND(E644>=EarliestDate,E644<=MostRecentDate),\"Past12Months\",\"NotPTM\")","v":"NotPTM"},{"$f":"TEXT(E644,\"ddd\")","v":"Wed"},{"$f":"F644*G644","v":10250}]
["North Coast","Connely. K","Beverages","Guaraná Fantástica",41879,50,43,2014,8,"Aug","YTD","NotPTM","Thu",2150]
["East Coast","Johnson. A","Grains/Cereals","Gustaf's Knäckebröd",41879,75,116.5,2014,8,"Aug","YTD","NotPTM","Thu",8737.5]
["West Coast","Rooney. Y","Dairy Products","Mozzarella di Giovanni",41879,30,41,2014,8,"Aug","YTD","NotPTM","Thu",1230]
["South Coast","Moodley. L","Produce","Rössle Sauerkraut",41879,50,153,2014,8,"Aug","YTD","NotPTM","Thu",7650]
["East Coast","Bonders. P","Seafood","Nord-Ost Matjeshering",41880,30,99,2014,8,"Aug","YTD","NotPTM","Fri",2970]
["East Coast","Peters. K","Meat/Poultry","Perth Pasties",41880,5,116.5,2014,8,"Aug","YTD","NotPTM","Fri",582.5]
["West Coast","Stanly. N","Meat/Poultry","Tourtière",41880,50,63,2014,8,"Aug","YTD","NotPTM","Fri",3150]
["North Coast","Dinnel. M","Grains/Cereals","Gustaf's Knäckebröd",41883,40,42.5,2014,9,"Sep","YTD","NotPTM","Mon",1700]
["East Coast","Newson. L","Seafood","Nord-Ost Matjeshering",41883,50,81,2014,9,"Sep","YTD","NotPTM","Mon",4050]
["West Coast","Numkin. M","Grains/Cereals","Singaporean Hokkien Fried Mee",41883,60,43,2014,9,"Sep","YTD","NotPTM","Mon",2580]
["West Coast","Toonly. S","Confections","Teatime Chocolate Biscuits",41883,7,104.5,2014,9,"Sep","YTD","NotPTM","Mon",731.5]
["South Coast","Grooner. T","Dairy Products","Camembert Pierrot",41884,70,87.5,2014,9,"Sep","YTD","NotPTM","Tue",6125]
["East Coast","Perks. M","Beverages","Chartreuse verte",41884,7,81,2014,9,"Sep","YTD","NotPTM","Tue",567]
["East Coast","Lavin. T","Condiments","Chef Anton's Cajun Seasoning",41884,52,364.5,2014,9,"Sep","YTD","NotPTM","Tue",18954]
["South Coast","Hannis. H","Confections","Pavlova",41884,125,69.5,2014,9,"Sep","YTD","NotPTM","Tue",8687.5]
["South Coast","Franly. S","Meat/Poultry","Tourtière",41884,75,78.5,2014,9,"Sep","YTD","NotPTM","Tue",5887.5]
["North Coast","Edford. O","Seafood","Jack's New England Clam Chowder",41885,75,153,2014,9,"Sep","YTD","NotPTM","Wed",11475]
["North Coast","Altercon. C","Dairy Products","Camembert Pierrot",41886,137,153,2014,9,"Sep","YTD","NotPTM","Thu",20961]
["South Coast","Jarison. P","Condiments","Genen Shouyu",41886,122,59.5,2014,9,"Sep","YTD","NotPTM","Thu",7259]
["North Coast","Atterson. P","Grains/Cereals","Gnocchi di nonna Alice",41886,175,58.5,2014,9,"Sep","YTD","NotPTM","Thu",10237.5]
["South Coast","Ilknis. K","Condiments","Gula Malacca",41886,150,45,2014,9,"Sep","YTD","NotPTM","Thu",6750]
["West Coast","Pursly. U","Seafood","Jack's New England Clam Chowder",41886,50,56,2014,9,"Sep","YTD","NotPTM","Thu",2800]
["West Coast","Rooney. Y","Seafood","Spegesild",41886,100,67.5,2014,9,"Sep","YTD","NotPTM","Thu",6750]
["West Coast","Oddesy. Y","Produce","Tofu",41886,112,54,2014,9,"Sep","YTD","NotPTM","Thu",6048]
["North Coast","Oxford. D","Confections","Zaanse koeken",41886,112,171,2014,9,"Sep","YTD","NotPTM","Thu",19152]
["North Coast","Edford. O","Seafood","Boston Crab Meat",41887,35,96.5,2014,9,"Sep","YTD","NotPTM","Fri",3377.5]
["North Coast","Connely. K","Dairy Products","Camembert Pierrot",41887,235,82.5,2014,9,"Sep","YTD","NotPTM","Fri",19387.5]
["West Coast","Stanly. N","Dairy Products","Gorgonzola Telino",41887,75,63,2014,9,"Sep","YTD","NotPTM","Fri",4725]
["North Coast","Dinnel. M","Condiments","Original Frankfurter grüne Soße",41887,25,94.5,2014,9,"Sep","YTD","NotPTM","Fri",2362.5]
["West Coast","Toonly. S","Beverages","Outback Lager",41887,20,56,2014,9,"Sep","YTD","NotPTM","Fri",1120]
["South Coast","Kinsly. N","Confections","Sir Rodney's Scones",41887,30,171,2014,9,"Sep","YTD","NotPTM","Fri",5130]
["East Coast","Anderson. P","Confections","Sir Rodney's Marmalade",41890,25,56,2014,9,"Sep","YTD","NotPTM","Mon",1400]
["East Coast","Johnson. A","Beverages","Chartreuse verte",41891,50,238.5,2014,9,"Sep","YTD","NotPTM","Tue",11925]
["South Coast","Lumford. T","Seafood","Escargots de Bourgogne",41891,37,94.5,2014,9,"Sep","YTD","NotPTM","Tue",3496.5]
["East Coast","Peters. K","Confections","Scottish Longbreads",41891,60,139.5,2014,9,"Sep","YTD","NotPTM","Tue",8370]
["East Coast","Lavin. T","Seafood","Boston Crab Meat",41892,25,221.5,2014,9,"Sep","YTD","NotPTM","Wed",5537.5]
["South Coast","Moodley. L","Grains/Cereals","Gnocchi di nonna Alice",41892,2,247.5,2014,9,"Sep","YTD","NotPTM","Wed",495]
["East Coast","Newson. L","Seafood","Ikura",41892,112,162,2014,9,"Sep","YTD","NotPTM","Wed",18144]
["South Coast","Franly. S","Condiments","Louisiana Fiery Hot Pepper Sauce",41892,25,81,2014,9,"Sep","YTD","NotPTM","Wed",2025]
["East Coast","Bonders. P","Produce","Manjimup Dried Apples",41892,75,82.5,2014,9,"Sep","YTD","NotPTM","Wed",6187.5]
["West Coast","Numkin. M","Grains/Cereals","Singaporean Hokkien Fried Mee",41892,25,78.5,2014,9,"Sep","YTD","NotPTM","Wed",1962.5]
["South Coast","Hannis. H","Beverages","Lakkalikööri",41893,10,108,2014,9,"Sep","YTD","NotPTM","Thu",1080]
["South Coast","Ilknis. K","Produce","Manjimup Dried Apples",41893,75,85.5,2014,9,"Sep","YTD","NotPTM","Thu",6412.5]
["South Coast","Grooner. T","Dairy Products","Raclette Courdavault",41893,50,238.5,2014,9,"Sep","YTD","NotPTM","Thu",11925]
["North Coast","Altercon. C","Dairy Products","Fløtemysost",41894,37,149.5,2014,9,"Sep","YTD","NotPTM","Fri",5531.5]
["East Coast","Perks. M","Dairy Products","Gudbrandsdalsost",41894,20,11,2014,9,"Sep","YTD","NotPTM","Fri",220]
["North Coast","Oxford. D","Condiments","Louisiana Fiery Hot Pepper Sauce",41894,90,557,2014,9,"Sep","YTD","NotPTM","Fri",50130]
["North Coast","Atterson. P","Meat/Poultry","Thüringer Rostbratwurst",41894,62,34.5,2014,9,"Sep","YTD","NotPTM","Fri",2139]
["West Coast","Oddesy. Y","Dairy Products","Gorgonzola Telino",41897,30,96.5,2014,9,"Sep","YTD","NotPTM","Mon",2895]
["South Coast","Kinsly. N","Seafood","Inlagd Sill",41897,7,78.5,2014,9,"Sep","YTD","NotPTM","Mon",549.5]
["South Coast","Jarison. P","Meat/Poultry","Pâté chinois",41897,62,63,2014,9,"Sep","YTD","NotPTM","Mon",3906]
["North Coast","Connely. K","Grains/Cereals","Wimmers gute Semmelknödel",41897,80,40.5,2014,9,"Sep","YTD","NotPTM","Mon",3240]
["South Coast","Lumford. T","Beverages","Laughing Lumberjack Lager",41898,12,40.5,2014,9,"Sep","YTD","NotPTM","Tue",486]
["North Coast","Dinnel. M","Beverages","Rhönbräu Klosterbier",41898,125,67.5,2014,9,"Sep","YTD","NotPTM","Tue",8437.5]
["North Coast","Oxford. D","Seafood","Röd Kaviar",41898,30,94.5,2014,9,"Sep","YTD","NotPTM","Tue",2835]
["North Coast","Altercon. C","Seafood","Spegesild",41898,15,207,2014,9,"Sep","YTD","NotPTM","Tue",3105]
["North Coast","Edford. O","Grains/Cereals","Tunnbröd",41898,150,54,2014,9,"Sep","YTD","NotPTM","Tue",8100]
["West Coast","Stanly. N","Beverages","Côte de Blaye",41899,75,59.5,2014,9,"Sep","YTD","NotPTM","Wed",4462.5]
["West Coast","Rooney. Y","Dairy Products","Fløtemysost",41899,15,63,2014,9,"Sep","YTD","NotPTM","Wed",945]
["North Coast","Atterson. P","Condiments","Louisiana Fiery Hot Pepper Sauce",41899,75,104.5,2014,9,"Sep","YTD","NotPTM","Wed",7837.5]
["West Coast","Pursly. U","Confections","Pavlova",41899,37,1185.5,2014,9,"Sep","YTD","NotPTM","Wed",43863.5]
["East Coast","Anderson. P","Confections","Tarte au sucre",41899,75,140.5,2014,9,"Sep","YTD","NotPTM","Wed",10537.5]
["North Coast","Connely. K","Beverages","Ipoh Coffee",41900,17,41,2014,9,"Sep","YTD","NotPTM","Thu",697]
["South Coast","Moodley. L","Confections","Pavlova",41900,25,147.5,{"$f":"YEAR(E708)","v":2014},{"$f":"MONTH(E708)","v":9},{"$f":"TEXT(E708,\"mmm\")","v":"Sep"},{"$f":"IF(I708<MONTH(TODAY()),\"YTD\",\"Not YTD\")","v":"YTD"},{"$f":"IF(AND(E708>=EarliestDate,E708<=MostRecentDate),\"Past12Months\",\"NotPTM\")","v":"NotPTM"},{"$f":"TEXT(E708,\"ddd\")","v":"Thu"},{"$f":"F708*G708","v":3687.5}]
["West Coast","Toonly. S","Grains/Cereals","Singaporean Hokkien Fried Mee",41900,125,78.5,2014,9,"Sep","YTD","NotPTM","Thu",9812.5]
["South Coast","Franly. S","Grains/Cereals","Tunnbröd",41900,5,139.5,2014,9,"Sep","YTD","NotPTM","Thu",697.5]
["West Coast","Numkin. M","Seafood","Escargots de Bourgogne",41901,75,34.5,2014,9,"Sep","YTD","NotPTM","Fri",2587.5]
["South Coast","Grooner. T","Meat/Poultry","Perth Pasties",41901,52,87.5,2014,9,"Sep","YTD","NotPTM","Fri",4550]
["North Coast","Dinnel. M","Produce","Tofu",41901,75,33.5,2014,9,"Sep","YTD","NotPTM","Fri",2512.5]
["East Coast","Johnson. A","Dairy Products","Geitost",41904,30,247.5,2014,9,"Sep","YTD","NotPTM","Mon",7425]
["South Coast","Ilknis. K","Condiments","Gula Malacca",41904,300,43,2014,9,"Sep","YTD","NotPTM","Mon",12900]
["East Coast","Peters. K","Confections","Gumbär Gummibärchen",41904,250,171,2014,9,"Sep","YTD","NotPTM","Mon",42750]
["South Coast","Hannis. H","Seafood","Ikura",41904,75,11,2014,9,"Sep","YTD","NotPTM","Mon",825]
["North Coast","Edford. O","Confections","Teatime Chocolate Biscuits",41904,50,56,2014,9,"Sep","YTD","NotPTM","Mon",2800]
["South Coast","Jarison. P","Dairy Products","Geitost",41905,30,45,2014,9,"Sep","YTD","NotPTM","Tue",1350]
["South Coast","Kinsly. N","Seafood","Jack's New England Clam Chowder",41905,75,11,2014,9,"Sep","YTD","NotPTM","Tue",825]
["East Coast","Newson. L","Dairy Products","Queso Manchego La Pastora",41905,75,41,2014,9,"Sep","YTD","NotPTM","Tue",3075]
["East Coast","Bonders. P","Dairy Products","Raclette Courdavault",41905,100,63,2014,9,"Sep","YTD","NotPTM","Tue",6300]
["North Coast","Oxford. D","Meat/Poultry","Tourtière",41905,10,76.5,2014,9,"Sep","YTD","NotPTM","Tue",765]
["North Coast","Altercon. C","Dairy Products","Gorgonzola Telino",41906,70,149.5,2014,9,"Sep","YTD","NotPTM","Wed",10465]
["West Coast","Oddesy. Y","Confections","Pavlova",41906,50,82.5,2014,9,"Sep","YTD","NotPTM","Wed",4125]
["East Coast","Lavin. T","Grains/Cereals","Singaporean Hokkien Fried Mee",41906,22,31.5,2014,9,"Sep","YTD","NotPTM","Wed",693]
["South Coast","Moodley. L","Dairy Products","Geitost",41907,37,140.5,2014,9,"Sep","YTD","NotPTM","Thu",5198.5]
["North Coast","Atterson. P","Condiments","Louisiana Hot Spiced Okra",41907,75,153,2014,9,"Sep","YTD","NotPTM","Thu",11475]
["West Coast","Pursly. U","Beverages","Rhönbräu Klosterbier",41907,10,43,2014,9,"Sep","YTD","NotPTM","Thu",430]
["South Coast","Lumford. T","Confections","Sir Rodney's Scones",41907,100,42.5,2014,9,"Sep","YTD","NotPTM","Thu",4250]
["East Coast","Perks. M","Confections","Teatime Chocolate Biscuits",41907,37,42.5,2014,9,"Sep","YTD","NotPTM","Thu",1572.5]
["North Coast","Connely. K","Grains/Cereals","Wimmers gute Semmelknödel",41907,25,557,2014,9,"Sep","YTD","NotPTM","Thu",13925]
["West Coast","Rooney. Y","Seafood","Boston Crab Meat",41908,75,175.5,2014,9,"Sep","YTD","NotPTM","Fri",13162.5]
["North Coast","Dinnel. M","Dairy Products","Camembert Pierrot",41908,87,81,2014,9,"Sep","YTD","NotPTM","Fri",7047]
["East Coast","Anderson. P","Grains/Cereals","Filo Mix",41908,50,139.5,2014,9,"Sep","YTD","NotPTM","Fri",6975]
["South Coast","Franly. S","Confections","Zaanse koeken",41908,45,139.5,2014,9,"Sep","YTD","NotPTM","Fri",6277.5]
["East Coast","Peters. K","Seafood","Ikura",41911,125,436.5,2014,9,"Sep","YTD","NotPTM","Mon",54562.5]
["West Coast","Stanly. N","Seafood","Jack's New England Clam Chowder",41911,35,63,2014,9,"Sep","YTD","NotPTM","Mon",2205]
["East Coast","Johnson. A","Confections","Zaanse koeken",41911,15,85.5,2014,9,"Sep","YTD","NotPTM","Mon",1282.5]
["West Coast","Toonly. S","Meat/Poultry","Alice Mutton",41912,150,205,2014,9,"Sep","YTD","NotPTM","Tue",30750]
["South Coast","Grooner. T","Confections","Gumbär Gummibärchen",41912,50,171,2014,9,"Sep","YTD","NotPTM","Tue",8550]
["East Coast","Bonders. P","Seafood","Inlagd Sill",41912,75,58.5,2014,9,"Sep","YTD","NotPTM","Tue",4387.5]
["East Coast","Newson. L","Meat/Poultry","Mishi Kobe Niku",41912,150,33.5,2014,9,"Sep","YTD","NotPTM","Tue",5025]
["North Coast","Edford. O","Meat/Poultry","Thüringer Rostbratwurst",41912,50,197.5,2014,9,"Sep","YTD","NotPTM","Tue",9875]
["North Coast","Oxford. D","Beverages","Chai",41913,100,207,2014,10,"Oct","Not YTD","NotPTM","Wed",20700]
["South Coast","Hannis. H","Seafood","Ikura",41913,60,87.5,2014,10,"Oct","Not YTD","NotPTM","Wed",5250]
["West Coast","Oddesy. Y","Produce","Rössle Sauerkraut",41913,62,247.5,2014,10,"Oct","Not YTD","NotPTM","Wed",15345]
["West Coast","Numkin. M","Beverages","Sasquatch Ale",41913,100,557,2014,10,"Oct","Not YTD","NotPTM","Wed",55700]
["South Coast","Ilknis. K","Grains/Cereals","Gnocchi di nonna Alice",41914,75,81,2014,10,"Oct","Not YTD","NotPTM","Thu",6075]
["East Coast","Lavin. T","Condiments","Original Frankfurter grüne Soße",41914,10,171,2014,10,"Oct","Not YTD","NotPTM","Thu",1710]
["South Coast","Kinsly. N","Beverages","Chai",41915,15,436.5,2014,10,"Oct","Not YTD","NotPTM","Fri",6547.5]
["South Coast","Jarison. P","Condiments","Gula Malacca",41915,120,221.5,2014,10,"Oct","Not YTD","NotPTM","Fri",26580]
["North Coast","Atterson. P","Beverages","Ipoh Coffee",41915,75,162,2014,10,"Oct","Not YTD","NotPTM","Fri",12150]
["South Coast","Lumford. T","Confections","Tarte au sucre",41915,125,67.5,2014,10,"Oct","Not YTD","NotPTM","Fri",8437.5]
["West Coast","Pursly. U","Meat/Poultry","Thüringer Rostbratwurst",41915,25,180,2014,10,"Oct","Not YTD","NotPTM","Fri",4500]
["North Coast","Altercon. C","Condiments","Vegie-spread",41915,37,67.5,2014,10,"Oct","Not YTD","NotPTM","Fri",2497.5]
["North Coast","Dinnel. M","Dairy Products","Gudbrandsdalsost",41918,20,175.5,2014,10,"Oct","Not YTD","NotPTM","Mon",3510]
["South Coast","Moodley. L","Meat/Poultry","Mishi Kobe Niku",41918,225,135,2014,10,"Oct","Not YTD","NotPTM","Mon",30375]
["South Coast","Franly. S","Beverages","Outback Lager",41918,22,81,2014,10,"Oct","Not YTD","NotPTM","Mon",1782]
["West Coast","Rooney. Y","Dairy Products","Raclette Courdavault",41918,50,20,2014,10,"Oct","Not YTD","NotPTM","Mon",1000]
["North Coast","Connely. K","Seafood","Röd Kaviar",41918,45,54,2014,10,"Oct","Not YTD","NotPTM","Mon",2430]
["East Coast","Perks. M","Meat/Poultry","Tourtière",41918,50,175.5,2014,10,"Oct","Not YTD","NotPTM","Mon",8775]
["South Coast","Grooner. T","Produce","Uncle Bob's Organic Dried Pears",41918,20,67.5,2014,10,"Oct","Not YTD","NotPTM","Mon",1350]
["West Coast","Toonly. S","Beverages","Guaraná Fantástica",41919,75,67.5,2014,10,"Oct","Not YTD","NotPTM","Tue",5062.5]
["West Coast","Stanly. N","Condiments","Northwoods Cranberry Sauce",41919,17,41,2014,10,"Oct","Not YTD","NotPTM","Tue",697]
["East Coast","Anderson. P","Dairy Products","Queso Manchego La Pastora",41919,75,59.5,2014,10,"Oct","Not YTD","NotPTM","Tue",4462.5]
["East Coast","Johnson. A","Meat/Poultry","Alice Mutton",41920,30,63,2014,10,"Oct","Not YTD","NotPTM","Wed",1890]
["East Coast","Peters. K","Seafood","Escargots de Bourgogne",41920,100,56,2014,10,"Oct","Not YTD","NotPTM","Wed",5600]
["West Coast","Oddesy. Y","Beverages","Outback Lager",41920,37,94.5,2014,10,"Oct","Not YTD","NotPTM","Wed",3496.5]
["North Coast","Edford. O","Seafood","Spegesild",41920,30,42.5,2014,10,"Oct","Not YTD","NotPTM","Wed",1275]
["South Coast","Hannis. H","Beverages","Steeleye Stout",41920,150,96.5,2014,10,"Oct","Not YTD","NotPTM","Wed",14475]
["West Coast","Numkin. M","Confections","Teatime Chocolate Biscuits",41920,30,557,{"$f":"YEAR(E772)","v":2014},{"$f":"MONTH(E772)","v":10},{"$f":"TEXT(E772,\"mmm\")","v":"Oct"},{"$f":"IF(I772<MONTH(TODAY()),\"YTD\",\"Not YTD\")","v":"Not YTD"},{"$f":"IF(AND(E772>=EarliestDate,E772<=MostRecentDate),\"Past12Months\",\"NotPTM\")","v":"NotPTM"},{"$f":"TEXT(E772,\"ddd\")","v":"Wed"},{"$f":"F772*G772","v":16710}]
["North Coast","Oxford. D","Meat/Poultry","Alice Mutton",41921,162,94.5,2014,10,"Oct","Not YTD","NotPTM","Thu",15309]
["North Coast","Atterson. P","Condiments","Louisiana Fiery Hot Pepper Sauce",41921,15,45,2014,10,"Oct","Not YTD","NotPTM","Thu",675]
["South Coast","Ilknis. K","Beverages","Outback Lager",41921,50,96.5,2014,10,"Oct","Not YTD","NotPTM","Thu",4825]
["West Coast","Rooney. Y","Dairy Products","Queso Cabrales",41921,15,99,2014,10,"Oct","Not YTD","NotPTM","Thu",1485]
["West Coast","Pursly. U","Meat/Poultry","Thüringer Rostbratwurst",41921,12,85.5,2014,10,"Oct","Not YTD","NotPTM","Thu",1026]
["North Coast","Altercon. C","Confections","Zaanse koeken",41921,12,81,2014,10,"Oct","Not YTD","NotPTM","Thu",972]
["North Coast","Connely. K","Beverages","Chai",41922,105,247.5,2014,10,"Oct","Not YTD","NotPTM","Fri",25987.5]
["South Coast","Jarison. P","Dairy Products","Fløtemysost",41922,87,67.5,2014,10,"Oct","Not YTD","NotPTM","Fri",5872.5]
["East Coast","Bonders. P","Beverages","Sasquatch Ale",41922,87,247.5,2014,10,"Oct","Not YTD","NotPTM","Fri",21532.5]
["East Coast","Newson. L","Confections","Scottish Longbreads",41922,12,85.5,2014,10,"Oct","Not YTD","NotPTM","Fri",1026]
["North Coast","Dinnel. M","Condiments","Aniseed Syrup",41925,125,81,2014,10,"Oct","Not YTD","NotPTM","Mon",10125]
["South Coast","Kinsly. N","Dairy Products","Fløtemysost",41925,10,144,2014,10,"Oct","Not YTD","NotPTM","Mon",1440]
["North Coast","Oxford. D","Beverages","Lakkalikööri",41925,50,56,2014,10,"Oct","Not YTD","NotPTM","Mon",2800]
["North Coast","Edford. O","Dairy Products","Raclette Courdavault",41925,60,57,2014,10,"Oct","Not YTD","NotPTM","Mon",3420]
["West Coast","Stanly. N","Beverages","Chang",41926,87,20,2014,10,"Oct","Not YTD","NotPTM","Tue",1740]
["West Coast","Toonly. S","Condiments","Chef Anton's Cajun Seasoning",41926,20,247.5,2014,10,"Oct","Not YTD","NotPTM","Tue",4950]
["North Coast","Altercon. C","Confections","Chocolade",41926,52,108,2014,10,"Oct","Not YTD","NotPTM","Tue",5616]
["West Coast","Numkin. M","Beverages","Guaraná Fantástica",41926,50,78.5,2014,10,"Oct","Not YTD","NotPTM","Tue",3925]
["East Coast","Lavin. T","Dairy Products","Raclette Courdavault",41926,25,153,2014,10,"Oct","Not YTD","NotPTM","Tue",3825]
["South Coast","Lumford. T","Seafood","Röd Kaviar",41926,100,87.5,2014,10,"Oct","Not YTD","NotPTM","Tue",8750]
["North Coast","Atterson. P","Dairy Products","Gorgonzola Telino",41927,10,96,2014,10,"Oct","Not YTD","NotPTM","Wed",960]
["South Coast","Moodley. L","Dairy Products","Mascarpone Fabioli",41927,12,41,2014,10,"Oct","Not YTD","NotPTM","Wed",492]
["West Coast","Rooney. Y","Beverages","Ipoh Coffee",41928,105,43,2014,10,"Oct","Not YTD","NotPTM","Thu",4515]
["West Coast","Stanly. N","Beverages","Outback Lager",41928,307,147.5,2014,10,"Oct","Not YTD","NotPTM","Thu",45282.5]
["North Coast","Connely. K","Meat/Poultry","Pâté chinois",41928,100,180,2014,10,"Oct","Not YTD","NotPTM","Thu",18000]
["West Coast","Pursly. U","Confections","Pavlova",41928,70,67.5,2014,10,"Oct","Not YTD","NotPTM","Thu",4725]
["West Coast","Oddesy. Y","Dairy Products","Raclette Courdavault",41928,60,207,2014,10,"Oct","Not YTD","NotPTM","Thu",12420]
["South Coast","Franly. S","Grains/Cereals","Ravioli Angelo",41928,30,41,2014,10,"Oct","Not YTD","NotPTM","Thu",1230]
["East Coast","Anderson. P","Dairy Products","Camembert Pierrot",41929,45,139.5,2014,10,"Oct","Not YTD","NotPTM","Fri",6277.5]
["North Coast","Dinnel. M","Condiments","Chef Anton's Gumbo Mix",41929,12,42.5,2014,10,"Oct","Not YTD","NotPTM","Fri",510]
["East Coast","Perks. M","Seafood","Inlagd Sill",41929,70,238.5,2014,10,"Oct","Not YTD","NotPTM","Fri",16695]
["East Coast","Johnson. A","Produce","Manjimup Dried Apples",41929,60,54,2014,10,"Oct","Not YTD","NotPTM","Fri",3240]
["North Coast","Edford. O","Condiments","Northwoods Cranberry Sauce",41929,30,59.5,2014,10,"Oct","Not YTD","NotPTM","Fri",1785]
["South Coast","Grooner. T","Confections","Teatime Chocolate Biscuits",41932,75,171,2014,10,"Oct","Not YTD","NotPTM","Mon",12825]
["North Coast","Oxford. D","Confections","Zaanse koeken",41932,75,85.5,2014,10,"Oct","Not YTD","NotPTM","Mon",6412.5]
["South Coast","Ilknis. K","Grains/Cereals","Gnocchi di nonna Alice",41933,25,128,2014,10,"Oct","Not YTD","NotPTM","Tue",3200]
["West Coast","Toonly. S","Seafood","Jack's New England Clam Chowder",41933,45,171,2014,10,"Oct","Not YTD","NotPTM","Tue",7695]
["West Coast","Numkin. M","Meat/Poultry","Perth Pasties",41933,75,140.5,2014,10,"Oct","Not YTD","NotPTM","Tue",10537.5]
["South Coast","Hannis. H","Confections","Teatime Chocolate Biscuits",41933,275,42.5,2014,10,"Oct","Not YTD","NotPTM","Tue",11687.5]
["East Coast","Newson. L","Meat/Poultry","Alice Mutton",41934,17,238.5,2014,10,"Oct","Not YTD","NotPTM","Wed",4054.5]
["North Coast","Atterson. P","Beverages","Chang",41934,25,247.5,2014,10,"Oct","Not YTD","NotPTM","Wed",6187.5]
["North Coast","Altercon. C","Seafood","Escargots de Bourgogne",41934,7,116.5,2014,10,"Oct","Not YTD","NotPTM","Wed",815.5]
["West Coast","Oddesy. Y","Grains/Cereals","Gnocchi di nonna Alice",41934,125,42.5,2014,10,"Oct","Not YTD","NotPTM","Wed",5312.5]
["West Coast","Pursly. U","Confections","Gumbär Gummibärchen",41934,52,139.5,2014,10,"Oct","Not YTD","NotPTM","Wed",7254]
["East Coast","Peters. K","Seafood","Ikura",41934,67,175.5,2014,10,"Oct","Not YTD","NotPTM","Wed",11758.5]
["South Coast","Jarison. P","Seafood","Røgede sild",41934,92,45,2014,10,"Oct","Not YTD","NotPTM","Wed",4140]
["East Coast","Bonders. P","Seafood","Spegesild",41934,75,96.5,2014,10,"Oct","Not YTD","NotPTM","Wed",7237.5]
["West Coast","Rooney. Y","Confections","Zaanse koeken",41934,30,281,2014,10,"Oct","Not YTD","NotPTM","Wed",8430]
["East Coast","Lavin. T","Dairy Products","Fløtemysost",41935,37,33.5,2014,10,"Oct","Not YTD","NotPTM","Thu",1239.5]
["West Coast","Stanly. N","Seafood","Ikura",41935,90,171,2014,10,"Oct","Not YTD","NotPTM","Thu",15390]
["East Coast","Johnson. A","Dairy Products","Gudbrandsdalsost",41936,100,85.5,2014,10,"Oct","Not YTD","NotPTM","Fri",8550]
["East Coast","Perks. M","Produce","Manjimup Dried Apples",41936,62,162,2014,10,"Oct","Not YTD","NotPTM","Fri",10044]
["South Coast","Lumford. T","Confections","Sir Rodney's Scones",41936,112,56,2014,10,"Oct","Not YTD","NotPTM","Fri",6272]
["South Coast","Kinsly. N","Condiments","Sirop d'érable",41936,50,221.5,2014,10,"Oct","Not YTD","NotPTM","Fri",11075]
["East Coast","Anderson. P","Meat/Poultry","Tourtière",41936,50,78.5,2014,10,"Oct","Not YTD","NotPTM","Fri",3925]
["West Coast","Toonly. S","Seafood","Carnarvon Tigers",41939,100,33.5,2014,10,"Oct","Not YTD","NotPTM","Mon",3350]
["East Coast","Bonders. P","Seafood","Inlagd Sill",41939,52,81,2014,10,"Oct","Not YTD","NotPTM","Mon",4212]
["North Coast","Connely. K","Seafood","Nord-Ost Matjeshering",41939,50,175.5,2014,10,"Oct","Not YTD","NotPTM","Mon",8775]
["East Coast","Peters. K","Confections","Pavlova",41939,20,96.5,2014,10,"Oct","Not YTD","NotPTM","Mon",1930]
["West Coast","Numkin. M","Dairy Products","Queso Manchego La Pastora",41939,7,85.5,2014,10,"Oct","Not YTD","NotPTM","Mon",598.5]
["South Coast","Moodley. L","Confections","Tarte au sucre",41939,125,56,2014,10,"Oct","Not YTD","NotPTM","Mon",7000]
["West Coast","Oddesy. Y","Meat/Poultry","Tourtière",41939,12,128,2014,10,"Oct","Not YTD","NotPTM","Mon",1536]
["East Coast","Newson. L","Dairy Products","Fløtemysost",41940,105,34.5,2014,10,"Oct","Not YTD","NotPTM","Tue",3622.5]
["East Coast","Lavin. T","Beverages","Steeleye Stout",41940,125,87.5,{"$f":"YEAR(E836)","v":2014},{"$f":"MONTH(E836)","v":10},{"$f":"TEXT(E836,\"mmm\")","v":"Oct"},{"$f":"IF(I836<MONTH(TODAY()),\"YTD\",\"Not YTD\")","v":"Not YTD"},{"$f":"IF(AND(E836>=EarliestDate,E836<=MostRecentDate),\"Past12Months\",\"NotPTM\")","v":"NotPTM"},{"$f":"TEXT(E836,\"ddd\")","v":"Tue"},{"$f":"F836*G836","v":10937.5}]
["West Coast","Pursly. U","Beverages","Chang",41941,40,139.5,2014,10,"Oct","Not YTD","NotPTM","Wed",5580]
["South Coast","Grooner. T","Dairy Products","Gorgonzola Telino",41941,62,99,2014,10,"Oct","Not YTD","NotPTM","Wed",6138]
["East Coast","Anderson. P","Condiments","Gula Malacca",41941,30,43,2014,10,"Oct","Not YTD","NotPTM","Wed",1290]
["East Coast","Perks. M","Beverages","Rhönbräu Klosterbier",41941,15,108,2014,10,"Oct","Not YTD","NotPTM","Wed",1620]
["South Coast","Franly. S","Confections","Scottish Longbreads",41941,37,140.5,2014,10,"Oct","Not YTD","NotPTM","Wed",5198.5]
["South Coast","Hannis. H","Confections","Gumbär Gummibärchen",41942,15,82.5,2014,10,"Oct","Not YTD","NotPTM","Thu",1237.5]
["West Coast","Stanly. N","Seafood","Ikura",41942,25,171,2014,10,"Oct","Not YTD","NotPTM","Thu",4275]
["West Coast","Rooney. Y","Condiments","Sirop d'érable",41942,10,31.5,2014,10,"Oct","Not YTD","NotPTM","Thu",315]
["West Coast","Toonly. S","Grains/Cereals","Filo Mix",41943,37,116.5,2014,10,"Oct","Not YTD","NotPTM","Fri",4310.5]
["East Coast","Peters. K","Seafood","Jack's New England Clam Chowder",41943,7,56,2014,10,"Oct","Not YTD","NotPTM","Fri",392]
["East Coast","Johnson. A","Meat/Poultry","Pâté chinois",41943,12,94.5,2014,10,"Oct","Not YTD","NotPTM","Fri",1134]
["North Coast","Edford. O","Meat/Poultry","Alice Mutton",41946,125,81,2014,11,"Nov","Not YTD","NotPTM","Mon",10125]
["South Coast","Ilknis. K","Condiments","Chef Anton's Cajun Seasoning",41946,30,108,2014,11,"Nov","Not YTD","NotPTM","Mon",3240]
["West Coast","Numkin. M","Grains/Cereals","Gnocchi di nonna Alice",41946,50,81,2014,11,"Nov","Not YTD","NotPTM","Mon",4050]
["East Coast","Bonders. P","Dairy Products","Queso Cabrales",41946,25,94.5,2014,11,"Nov","Not YTD","NotPTM","Mon",2362.5]
["North Coast","Dinnel. M","Dairy Products","Raclette Courdavault",41946,37,153,2014,11,"Nov","Not YTD","NotPTM","Mon",5661]
["South Coast","Jarison. P","Seafood","Boston Crab Meat",41947,75,45,2014,11,"Nov","Not YTD","NotPTM","Tue",3375]
["North Coast","Oxford. D","Dairy Products","Camembert Pierrot",41947,75,238.5,2014,11,"Nov","Not YTD","NotPTM","Tue",17887.5]
["North Coast","Altercon. C","Beverages","Chai",41947,100,45,2014,11,"Nov","Not YTD","NotPTM","Tue",4500]
["West Coast","Oddesy. Y","Seafood","Nord-Ost Matjeshering",41947,75,112.5,2014,11,"Nov","Not YTD","NotPTM","Tue",8437.5]
["South Coast","Kinsly. N","Meat/Poultry","Pâté chinois",41947,100,73,2014,11,"Nov","Not YTD","NotPTM","Tue",7300]
["South Coast","Lumford. T","Confections","Sir Rodney's Scones",41947,37,116.5,2014,11,"Nov","Not YTD","NotPTM","Tue",4310.5]
["South Coast","Moodley. L","Confections","Valkoinen suklaa",41947,50,205,2014,11,"Nov","Not YTD","NotPTM","Tue",10250]
["East Coast","Newson. L","Dairy Products","Gorgonzola Telino",41948,37,78.5,2014,11,"Nov","Not YTD","NotPTM","Wed",2904.5]
["East Coast","Lavin. T","Condiments","Louisiana Fiery Hot Pepper Sauce",41948,40,104.5,2014,11,"Nov","Not YTD","NotPTM","Wed",4180]
["East Coast","Perks. M","Confections","Pavlova",41948,50,81,2014,11,"Nov","Not YTD","NotPTM","Wed",4050]
["West Coast","Pursly. U","Beverages","Lakkalikööri",41949,50,34.5,2014,11,"Nov","Not YTD","NotPTM","Thu",1725]
["North Coast","Atterson. P","Produce","Manjimup Dried Apples",41949,62,31.5,2014,11,"Nov","Not YTD","NotPTM","Thu",1953]
["North Coast","Connely. K","Confections","Sir Rodney's Scones",41949,5,58.5,2014,11,"Nov","Not YTD","NotPTM","Thu",292.5]
["North Coast","Dinnel. M","Grains/Cereals","Filo Mix",41950,50,128,2014,11,"Nov","Not YTD","NotPTM","Fri",6400]
["West Coast","Rooney. Y","Condiments","Grandma's Boysenberry Spread",41950,100,94.5,2014,11,"Nov","Not YTD","NotPTM","Fri",9450]
["East Coast","Johnson. A","Beverages","Lakkalikööri",41950,35,171,2014,11,"Nov","Not YTD","NotPTM","Fri",5985]
["South Coast","Franly. S","Seafood","Nord-Ost Matjeshering",41950,7,78.5,2014,11,"Nov","Not YTD","NotPTM","Fri",549.5]
["South Coast","Grooner. T","Produce","Rössle Sauerkraut",41950,45,31.5,2014,11,"Nov","Not YTD","NotPTM","Fri",1417.5]
["East Coast","Anderson. P","Produce","Tofu",41950,10,27,2014,11,"Nov","Not YTD","NotPTM","Fri",270]
["North Coast","Edford. O","Condiments","Original Frankfurter grüne Soße",41953,30,43,2014,11,"Nov","Not YTD","NotPTM","Mon",1290]
["North Coast","Oxford. D","Condiments","Sirop d'érable",41953,15,85.5,2014,11,"Nov","Not YTD","NotPTM","Mon",1282.5]
["North Coast","Altercon. C","Seafood","Jack's New England Clam Chowder",41954,87,81,2014,11,"Nov","Not YTD","NotPTM","Tue",7047]
["East Coast","Peters. K","Seafood","Konbu",41954,100,42.5,2014,11,"Nov","Not YTD","NotPTM","Tue",4250]
["West Coast","Toonly. S","Condiments","Louisiana Fiery Hot Pepper Sauce",41954,125,153,2014,11,"Nov","Not YTD","NotPTM","Tue",19125]
["West Coast","Stanly. N","Beverages","Rhönbräu Klosterbier",41954,87,156.5,2014,11,"Nov","Not YTD","NotPTM","Tue",13615.5]
["South Coast","Ilknis. K","Grains/Cereals","Filo Mix",41955,70,54,2014,11,"Nov","Not YTD","NotPTM","Wed",3780]
["North Coast","Atterson. P","Seafood","Inlagd Sill",41955,37,85.5,2014,11,"Nov","Not YTD","NotPTM","Wed",3163.5]
["South Coast","Hannis. H","Confections","Pavlova",41955,12,205,2014,11,"Nov","Not YTD","NotPTM","Wed",2460]
["East Coast","Bonders. P","Grains/Cereals","Gnocchi di nonna Alice",41956,50,45,2014,11,"Nov","Not YTD","NotPTM","Thu",2250]
["East Coast","Newson. L","Seafood","Røgede sild",41956,125,82.5,2014,11,"Nov","Not YTD","NotPTM","Thu",10312.5]
["South Coast","Jarison. P","Produce","Rössle Sauerkraut",41956,17,156.5,2014,11,"Nov","Not YTD","NotPTM","Thu",2660.5]
["North Coast","Connely. K","Beverages","Steeleye Stout",41956,112,247.5,2014,11,"Nov","Not YTD","NotPTM","Thu",27720]
["East Coast","Lavin. T","Condiments","Aniseed Syrup",41957,87,43,2014,11,"Nov","Not YTD","NotPTM","Fri",3741]
["West Coast","Oddesy. Y","Dairy Products","Camembert Pierrot",41957,22,221.5,2014,11,"Nov","Not YTD","NotPTM","Fri",4873]
["North Coast","Dinnel. M","Beverages","Chang",41957,22,197.5,2014,11,"Nov","Not YTD","NotPTM","Fri",4345]
["West Coast","Numkin. M","Dairy Products","Mozzarella di Giovanni",41957,15,27,2014,11,"Nov","Not YTD","NotPTM","Fri",405]
["East Coast","Perks. M","Seafood","Boston Crab Meat",41960,15,247.5,2014,11,"Nov","Not YTD","NotPTM","Mon",3712.5]
["South Coast","Kinsly. N","Seafood","Spegesild",41960,40,87.5,2014,11,"Nov","Not YTD","NotPTM","Mon",3500]
["South Coast","Franly. S","Seafood","Carnarvon Tigers",41961,25,81,2014,11,"Nov","Not YTD","NotPTM","Tue",2025]
["South Coast","Moodley. L","Condiments","Gula Malacca",41961,20,56,2014,11,"Nov","Not YTD","NotPTM","Tue",1120]
["South Coast","Lumford. T","Dairy Products","Mozzarella di Giovanni",41961,60,281,2014,11,"Nov","Not YTD","NotPTM","Tue",16860]
["North Coast","Edford. O","Dairy Products","Raclette Courdavault",41961,70,63,2014,11,"Nov","Not YTD","NotPTM","Tue",4410]
["South Coast","Grooner. T","Dairy Products","Gorgonzola Telino",41962,100,82.5,2014,11,"Nov","Not YTD","NotPTM","Wed",8250]
["West Coast","Stanly. N","Dairy Products","Gudbrandsdalsost",41962,62,247.5,2014,11,"Nov","Not YTD","NotPTM","Wed",15345]
["East Coast","Anderson. P","Seafood","Jack's New England Clam Chowder",41962,75,116.5,2014,11,"Nov","Not YTD","NotPTM","Wed",8737.5]
["West Coast","Pursly. U","Seafood","Konbu",41962,175,162,2014,11,"Nov","Not YTD","NotPTM","Wed",28350]
["North Coast","Altercon. C","Grains/Cereals","Singaporean Hokkien Fried Mee",41962,12,104.5,2014,11,"Nov","Not YTD","NotPTM","Wed",1254]
["West Coast","Rooney. Y","Confections","Tarte au sucre",41962,110,40.5,{"$f":"YEAR(E900)","v":2014},{"$f":"MONTH(E900)","v":11},{"$f":"TEXT(E900,\"mmm\")","v":"Nov"},{"$f":"IF(I900<MONTH(TODAY()),\"YTD\",\"Not YTD\")","v":"Not YTD"},{"$f":"IF(AND(E900>=EarliestDate,E900<=MostRecentDate),\"Past12Months\",\"NotPTM\")","v":"NotPTM"},{"$f":"TEXT(E900,\"ddd\")","v":"Wed"},{"$f":"F900*G900","v":4455}]
["North Coast","Oxford. D","Condiments","Vegie-spread",41962,107,171,2014,11,"Nov","Not YTD","NotPTM","Wed",18297]
["South Coast","Ilknis. K","Seafood","Boston Crab Meat",41963,10,42.5,2014,11,"Nov","Not YTD","NotPTM","Thu",425]
["North Coast","Atterson. P","Grains/Cereals","Gnocchi di nonna Alice",41963,100,42.5,2014,11,"Nov","Not YTD","NotPTM","Thu",4250]
["South Coast","Hannis. H","Beverages","Lakkalikööri",41963,50,73,2014,11,"Nov","Not YTD","NotPTM","Thu",3650]
["East Coast","Johnson. A","Dairy Products","Raclette Courdavault",41963,62,162,2014,11,"Nov","Not YTD","NotPTM","Thu",10044]
["West Coast","Toonly. S","Grains/Cereals","Tunnbröd",41963,30,140.5,2014,11,"Nov","Not YTD","NotPTM","Thu",4215]
["West Coast","Numkin. M","Dairy Products","Raclette Courdavault",41964,37,67.5,2014,11,"Nov","Not YTD","NotPTM","Fri",2497.5]
["North Coast","Dinnel. M","Seafood","Røgede sild",41964,20,81,2014,11,"Nov","Not YTD","NotPTM","Fri",1620]
["North Coast","Connely. K","Produce","Tofu",41964,7,162,2014,11,"Nov","Not YTD","NotPTM","Fri",1134]
["North Coast","Oxford. D","Beverages","Chai",41967,17,247.5,2014,11,"Nov","Not YTD","NotPTM","Mon",4207.5]
["North Coast","Edford. O","Dairy Products","Gudbrandsdalsost",41967,75,171,2014,11,"Nov","Not YTD","NotPTM","Mon",12825]
["West Coast","Oddesy. Y","Confections","Gumbär Gummibärchen",41967,7,82.5,2014,11,"Nov","Not YTD","NotPTM","Mon",577.5]
["East Coast","Peters. K","Seafood","Nord-Ost Matjeshering",41967,75,221.5,2014,11,"Nov","Not YTD","NotPTM","Mon",16612.5]
["West Coast","Pursly. U","Seafood","Röd Kaviar",41967,12,45,2014,11,"Nov","Not YTD","NotPTM","Mon",540]
["South Coast","Jarison. P","Confections","Valkoinen suklaa",41967,35,87.5,2014,11,"Nov","Not YTD","NotPTM","Mon",3062.5]
["West Coast","Rooney. Y","Seafood","Boston Crab Meat",41968,50,85.5,2014,11,"Nov","Not YTD","NotPTM","Tue",4275]
["West Coast","Stanly. N","Produce","Longlife Tofu",41968,75,63,2014,11,"Nov","Not YTD","NotPTM","Tue",4725]
["South Coast","Kinsly. N","Seafood","Røgede sild",41968,75,42.5,2014,11,"Nov","Not YTD","NotPTM","Tue",3187.5]
["North Coast","Altercon. C","Grains/Cereals","Gnocchi di nonna Alice",41969,50,162,2014,11,"Nov","Not YTD","NotPTM","Wed",8100]
["East Coast","Bonders. P","Dairy Products","Gudbrandsdalsost",41969,50,140.5,2014,11,"Nov","Not YTD","NotPTM","Wed",7025]
["South Coast","Lumford. T","Grains/Cereals","Ravioli Angelo",41969,15,56,2014,11,"Nov","Not YTD","NotPTM","Wed",840]
["South Coast","Moodley. L","Confections","Zaanse koeken",41969,52,281,2014,11,"Nov","Not YTD","NotPTM","Wed",14612]
["South Coast","Grooner. T","Seafood","Carnarvon Tigers",41970,87,63,2014,11,"Nov","Not YTD","NotPTM","Thu",5481]
["North Coast","Connely. K","Dairy Products","Gudbrandsdalsost",41970,25,144,2014,11,"Nov","Not YTD","NotPTM","Thu",3600]
["West Coast","Toonly. S","Seafood","Inlagd Sill",41970,100,67.5,2014,11,"Nov","Not YTD","NotPTM","Thu",6750]
["North Coast","Atterson. P","Dairy Products","Raclette Courdavault",41970,60,149.5,2014,11,"Nov","Not YTD","NotPTM","Thu",8970]
["West Coast","Numkin. M","Beverages","Sasquatch Ale",41970,70,238.5,2014,11,"Nov","Not YTD","NotPTM","Thu",16695]
["South Coast","Franly. S","Confections","Scottish Longbreads",41970,75,207,2014,11,"Nov","Not YTD","NotPTM","Thu",15525]
["East Coast","Newson. L","Confections","Tarte au sucre",41970,30,63,2014,11,"Nov","Not YTD","NotPTM","Thu",1890]
["North Coast","Dinnel. M","Grains/Cereals","Wimmers gute Semmelknödel",41970,150,31.5,2014,11,"Nov","Not YTD","NotPTM","Thu",4725]
["North Coast","Oxford. D","Grains/Cereals","Filo Mix",41971,45,34.5,2014,11,"Nov","Not YTD","NotPTM","Fri",1552.5]
["East Coast","Lavin. T","Confections","Gumbär Gummibärchen",41971,100,197.5,2014,11,"Nov","Not YTD","NotPTM","Fri",19750]
["North Coast","Edford. O","Dairy Products","Mascarpone Fabioli",41971,40,81,2014,11,"Nov","Not YTD","NotPTM","Fri",3240]
["West Coast","Oddesy. Y","Beverages","Outback Lager",41971,150,171,2014,11,"Nov","Not YTD","NotPTM","Fri",25650]
["South Coast","Hannis. H","Beverages","Ipoh Coffee",41974,50,20,2014,12,"Dec","Not YTD","NotPTM","Mon",1000]
["East Coast","Perks. M","Confections","NuNuCa Nuß-Nougat-Creme",41974,325,81,2014,12,"Dec","Not YTD","NotPTM","Mon",26325]
["East Coast","Anderson. P","Confections","Schoggi Schokolade",41974,37,221.5,2014,12,"Dec","Not YTD","NotPTM","Mon",8195.5]
["North Coast","Altercon. C","Beverages","Chartreuse verte",41975,75,42.5,2014,12,"Dec","Not YTD","NotPTM","Tue",3187.5]
["West Coast","Rooney. Y","Grains/Cereals","Gnocchi di nonna Alice",41975,100,56,2014,12,"Dec","Not YTD","NotPTM","Tue",5600]
["West Coast","Pursly. U","Produce","Manjimup Dried Apples",41975,5,63,2014,12,"Dec","Not YTD","NotPTM","Tue",315]
["South Coast","Ilknis. K","Confections","NuNuCa Nuß-Nougat-Creme",41975,100,45,2014,12,"Dec","Not YTD","NotPTM","Tue",4500]
["North Coast","Atterson. P","Beverages","Rhönbräu Klosterbier",41975,15,94.5,2014,12,"Dec","Not YTD","NotPTM","Tue",1417.5]
["North Coast","Connely. K","Confections","Zaanse koeken",41975,50,45,2014,12,"Dec","Not YTD","NotPTM","Tue",2250]
["North Coast","Edford. O","Condiments","Aniseed Syrup",41976,87,135,2014,12,"Dec","Not YTD","NotPTM","Wed",11745]
["East Coast","Johnson. A","Beverages","Chartreuse verte",41976,82,175.5,2014,12,"Dec","Not YTD","NotPTM","Wed",14391]
["South Coast","Jarison. P","Beverages","Guaraná Fantástica",41976,30,96.5,2014,12,"Dec","Not YTD","NotPTM","Wed",2895]
["North Coast","Dinnel. M","Grains/Cereals","Gustaf's Knäckebröd",41976,200,94.5,2014,12,"Dec","Not YTD","NotPTM","Wed",18900]
["South Coast","Kinsly. N","Confections","Sir Rodney's Scones",41976,37,153,2014,12,"Dec","Not YTD","NotPTM","Wed",5661]
["North Coast","Oxford. D","Condiments","Louisiana Fiery Hot Pepper Sauce",41977,100,85.5,2014,12,"Dec","Not YTD","NotPTM","Thu",8550]
["North Coast","Atterson. P","Beverages","Chang",41978,37,31.5,2014,12,"Dec","Not YTD","NotPTM","Fri",1165.5]
["West Coast","Toonly. S","Confections","Scottish Longbreads",41978,75,43,2014,12,"Dec","Not YTD","NotPTM","Fri",3225]
["West Coast","Stanly. N","Grains/Cereals","Singaporean Hokkien Fried Mee",41978,50,128,2014,12,"Dec","Not YTD","NotPTM","Fri",6400]
["North Coast","Altercon. C","Produce","Uncle Bob's Organic Dried Pears",41978,10,94.5,2014,12,"Dec","Not YTD","NotPTM","Fri",945]
["South Coast","Moodley. L","Dairy Products","Camembert Pierrot",41981,62,247.5,2014,12,"Dec","Not YTD","NotPTM","Mon",15345]
["North Coast","Dinnel. M","Grains/Cereals","Filo Mix",41981,300,238.5,2014,12,"Dec","Not YTD","NotPTM","Mon",71550]
["South Coast","Lumford. T","Dairy Products","Fløtemysost",41981,125,56,2014,12,"Dec","Not YTD","NotPTM","Mon",7000]
["South Coast","Franly. S","Dairy Products","Gorgonzola Telino",41981,67,42.5,2014,12,"Dec","Not YTD","NotPTM","Mon",2847.5]
["North Coast","Connely. K","Grains/Cereals","Gustaf's Knäckebröd",41981,125,76.5,2014,12,"Dec","Not YTD","NotPTM","Mon",9562.5]
["West Coast","Oddesy. Y","Seafood","Jack's New England Clam Chowder",41981,40,96.5,2014,12,"Dec","Not YTD","NotPTM","Mon",3860]
["West Coast","Numkin. M","Condiments","Sirop d'érable",41981,37,94.5,2014,12,"Dec","Not YTD","NotPTM","Mon",3496.5]
["East Coast","Peters. K","Confections","Tarte au sucre",41981,180,56,2014,12,"Dec","Not YTD","NotPTM","Mon",10080]
["West Coast","Pursly. U","Dairy Products","Queso Cabrales",41982,45,557,2014,12,"Dec","Not YTD","NotPTM","Tue",25065]
["West Coast","Rooney. Y","Dairy Products","Fløtemysost",41983,17,34.5,2014,12,"Dec","Not YTD","NotPTM","Wed",586.5]
["South Coast","Grooner. T","Dairy Products","Raclette Courdavault",41983,50,221.5,{"$f":"YEAR(E964)","v":2014},{"$f":"MONTH(E964)","v":12},{"$f":"TEXT(E964,\"mmm\")","v":"Dec"},{"$f":"IF(I964<MONTH(TODAY()),\"YTD\",\"Not YTD\")","v":"Not YTD"},{"$f":"IF(AND(E964>=EarliestDate,E964<=MostRecentDate),\"Past12Months\",\"NotPTM\")","v":"NotPTM"},{"$f":"TEXT(E964,\"ddd\")","v":"Wed"},{"$f":"F964*G964","v":11075}]
["West Coast","Stanly. N","Meat/Poultry","Thüringer Rostbratwurst",41983,15,139.5,2014,12,"Dec","Not YTD","NotPTM","Wed",2092.5]
["East Coast","Bonders. P","Meat/Poultry","Alice Mutton",41984,7,63,2014,12,"Dec","Not YTD","NotPTM","Thu",441]
["East Coast","Newson. L","Dairy Products","Gorgonzola Telino",41984,40,56,2014,12,"Dec","Not YTD","NotPTM","Thu",2240]
["North Coast","Edford. O","Condiments","Louisiana Hot Spiced Okra",41984,2,56,2014,12,"Dec","Not YTD","NotPTM","Thu",112]
["West Coast","Toonly. S","Beverages","Rhönbräu Klosterbier",41984,80,63,2014,12,"Dec","Not YTD","NotPTM","Thu",5040]
["West Coast","Numkin. M","Seafood","Ikura",41985,25,43,2014,12,"Dec","Not YTD","NotPTM","Fri",1075]
["East Coast","Lavin. T","Beverages","Laughing Lumberjack Lager",41985,37,58.5,2014,12,"Dec","Not YTD","NotPTM","Fri",2164.5]
["East Coast","Perks. M","Dairy Products","Gorgonzola Telino",41988,50,78.5,2014,12,"Dec","Not YTD","NotPTM","Mon",3925]
["North Coast","Oxford. D","Produce","Manjimup Dried Apples",41988,50,171,2014,12,"Dec","Not YTD","NotPTM","Mon",8550]
["South Coast","Hannis. H","Seafood","Røgede sild",41988,7,33.5,2014,12,"Dec","Not YTD","NotPTM","Mon",234.5]
["West Coast","Oddesy. Y","Grains/Cereals","Singaporean Hokkien Fried Mee",41988,87,67.5,2014,12,"Dec","Not YTD","NotPTM","Mon",5872.5]
["West Coast","Pursly. U","Seafood","Jack's New England Clam Chowder",41989,50,557,2014,12,"Dec","Not YTD","NotPTM","Tue",27850]
["East Coast","Anderson. P","Condiments","Original Frankfurter grüne Soße",41989,87,45,2014,12,"Dec","Not YTD","NotPTM","Tue",3915]
["West Coast","Rooney. Y","Beverages","Outback Lager",41989,37,81,2014,12,"Dec","Not YTD","NotPTM","Tue",2997]
["East Coast","Johnson. A","Confections","Pavlova",41989,5,81,2014,12,"Dec","Not YTD","NotPTM","Tue",405]
["South Coast","Ilknis. K","Confections","Tarte au sucre",41989,25,56,2014,12,"Dec","Not YTD","NotPTM","Tue",1400]
["North Coast","Atterson. P","Grains/Cereals","Gnocchi di nonna Alice",41990,37,116.5,2014,12,"Dec","Not YTD","NotPTM","Wed",4310.5]
["North Coast","Altercon. C","Dairy Products","Gorgonzola Telino",41990,25,139.5,2014,12,"Dec","Not YTD","NotPTM","Wed",3487.5]
["East Coast","Peters. K","Produce","Longlife Tofu",41990,12,1185.5,2014,12,"Dec","Not YTD","NotPTM","Wed",14226]
["South Coast","Jarison. P","Meat/Poultry","Tourtière",41990,75,85.5,2014,12,"Dec","Not YTD","NotPTM","Wed",6412.5]
["East Coast","Bonders. P","Beverages","Chartreuse verte",41991,25,34.5,2014,12,"Dec","Not YTD","NotPTM","Thu",862.5]
["East Coast","Newson. L","Beverages","Côte de Blaye",41991,75,156.5,2014,12,"Dec","Not YTD","NotPTM","Thu",11737.5]
["South Coast","Kinsly. N","Dairy Products","Gorgonzola Telino",41991,37,85.5,2014,12,"Dec","Not YTD","NotPTM","Thu",3163.5]
["North Coast","Connely. K","Seafood","Ikura",41991,75,180,2014,12,"Dec","Not YTD","NotPTM","Thu",13500]
["South Coast","Lumford. T","Seafood","Inlagd Sill",41991,105,34.5,2014,12,"Dec","Not YTD","NotPTM","Thu",3622.5]
["East Coast","Perks. M","Dairy Products","Mozzarella di Giovanni",41991,50,171,2014,12,"Dec","Not YTD","NotPTM","Thu",8550]
["East Coast","Lavin. T","Beverages","Rhönbräu Klosterbier",41991,45,56,2014,12,"Dec","Not YTD","NotPTM","Thu",2520]
["South Coast","Moodley. L","Beverages","Chang",41992,50,43,2014,12,"Dec","Not YTD","NotPTM","Fri",2150]
["North Coast","Dinnel. M","Seafood","Nord-Ost Matjeshering",41992,7,135,2014,12,"Dec","Not YTD","NotPTM","Fri",945]
["North Coast","Edford. O","Condiments","Northwoods Cranberry Sauce",41992,35,557,2014,12,"Dec","Not YTD","NotPTM","Fri",19495]
["South Coast","Franly. S","Beverages","Rhönbräu Klosterbier",41992,37,104.5,2014,12,"Dec","Not YTD","NotPTM","Fri",3866.5]
["West Coast","Stanly. N","Meat/Poultry","Thüringer Rostbratwurst",41992,75,197.5,2014,12,"Dec","Not YTD","NotPTM","Fri",14812.5]
["East Coast","Peters. K","Seafood","Carnarvon Tigers",41995,37,56,2014,12,"Dec","Not YTD","NotPTM","Mon",2072]
["East Coast","Johnson. A","Grains/Cereals","Gnocchi di nonna Alice",41995,100,34.5,2014,12,"Dec","Not YTD","NotPTM","Mon",3450]
["East Coast","Bonders. P","Beverages","Rhönbräu Klosterbier",41995,15,33.5,2014,12,"Dec","Not YTD","NotPTM","Mon",502.5]
["East Coast","Anderson. P","Confections","Scottish Longbreads",41995,75,281,2014,12,"Dec","Not YTD","NotPTM","Mon",21075]
["West Coast","Toonly. S","Beverages","Steeleye Stout",41995,125,41,2014,12,"Dec","Not YTD","NotPTM","Mon",5125]
["West Coast","Oddesy. Y","Confections","Teatime Chocolate Biscuits",41995,25,85.5,2014,12,"Dec","Not YTD","NotPTM","Mon",2137.5]
["North Coast","Oxford. D","Produce","Uncle Bob's Organic Dried Pears",41995,50,94.5,2014,12,"Dec","Not YTD","NotPTM","Mon",4725]
["West Coast","Numkin. M","Condiments","Vegie-spread",41995,7,33.5,2014,12,"Dec","Not YTD","NotPTM","Mon",234.5]
["West Coast","Rooney. Y","Beverages","Chang",41996,35,43,2014,12,"Dec","Not YTD","NotPTM","Tue",1505]
["South Coast","Grooner. T","Seafood","Jack's New England Clam Chowder",41996,87,175.5,2014,12,"Dec","Not YTD","NotPTM","Tue",15268.5]
["East Coast","Newson. L","Confections","Scottish Longbreads",41996,25,87.5,2014,12,"Dec","Not YTD","NotPTM","Tue",2187.5]
["North Coast","Altercon. C","Meat/Poultry","Thüringer Rostbratwurst",41996,52,140.5,2014,12,"Dec","Not YTD","NotPTM","Tue",7306]
["West Coast","Pursly. U","Meat/Poultry","Tourtière",41996,20,31.5,2014,12,"Dec","Not YTD","NotPTM","Tue",630]
["South Coast","Ilknis. K","Meat/Poultry","Alice Mutton",41997,25,156.5,2014,12,"Dec","Not YTD","NotPTM","Wed",3912.5]
["West Coast","Stanly. N","Grains/Cereals","Filo Mix",41997,162,78.5,2014,12,"Dec","Not YTD","NotPTM","Wed",12717]
["West Coast","Toonly. S","Seafood","Jack's New England Clam Chowder",41997,60,162,2014,12,"Dec","Not YTD","NotPTM","Wed",9720]
["West Coast","Numkin. M","Confections","Pavlova",41997,50,20,2014,12,"Dec","Not YTD","NotPTM","Wed",1000]
["South Coast","Hannis. H","Produce","Tofu",41997,5,221.5,2014,12,"Dec","Not YTD","NotPTM","Wed",1107.5]
["East Coast","Lavin. T","Meat/Poultry","Tourtière",41997,17,33.5,2014,12,"Dec","Not YTD","NotPTM","Wed",569.5]
["West Coast","Oddesy. Y","Dairy Products","Gudbrandsdalsost",41998,62,116.5,2014,12,"Dec","Not YTD","NotPTM","Thu",7223]
["East Coast","Perks. M","Condiments","Gula Malacca",41998,50,27,2014,12,"Dec","Not YTD","NotPTM","Thu",1350]
["North Coast","Connely. K","Confections","Gumbär Gummibärchen",41998,25,238.5,2014,12,"Dec","Not YTD","NotPTM","Thu",5962.5]
["North Coast","Atterson. P","Dairy Products","Queso Cabrales",41998,87,149.5,2014,12,"Dec","Not YTD","NotPTM","Thu",13006.5]
["North Coast","Dinnel. M","Grains/Cereals","Wimmers gute Semmelknödel",41998,62,247.5,2014,12,"Dec","Not YTD","NotPTM","Thu",15345]
["West Coast","Pursly. U","Beverages","Guaraná Fantástica",41999,10,90,2014,12,"Dec","Not YTD","NotPTM","Fri",900]
["East Coast","Johnson. A","Seafood","Konbu",41999,150,108,2014,12,"Dec","Not YTD","NotPTM","Fri",16200]
["North Coast","Edford. O","Produce","Manjimup Dried Apples",41999,37,63,2014,12,"Dec","Not YTD","NotPTM","Fri",2331]
["South Coast","Kinsly. N","Dairy Products","Mozzarella di Giovanni",41999,50,557,2014,12,"Dec","Not YTD","NotPTM","Fri",27850]
["East Coast","Peters. K","Dairy Products","Queso Cabrales",41999,25,1185.5,2014,12,"Dec","Not YTD","NotPTM","Fri",29637.5]
["North Coast","Oxford. D","Dairy Products","Raclette Courdavault",41999,5,94.5,2014,12,"Dec","Not YTD","NotPTM","Fri",472.5]
["South Coast","Jarison. P","Confections","Tarte au sucre",41999,12,221.5,2014,12,"Dec","Not YTD","NotPTM","Fri",2658]
["East Coast","Anderson. P","Meat/Poultry","Tourtière",41999,125,94.5,{"$f":"YEAR(E1028)","v":2014},{"$f":"MONTH(E1028)","v":12},{"$f":"TEXT(E1028,\"mmm\")","v":"Dec"},{"$f":"IF(I1028<MONTH(TODAY()),\"YTD\",\"Not YTD\")","v":"Not YTD"},{"$f":"IF(AND(E1028>=EarliestDate,E1028<=MostRecentDate),\"Past12Months\",\"NotPTM\")","v":"NotPTM"},{"$f":"TEXT(E1028,\"ddd\")","v":"Fri"},{"$f":"F1028*G1028","v":11812.5}]
["South Coast","Grooner. T","Meat/Poultry","Alice Mutton",42002,52,445.5,2014,12,"Dec","Not YTD","NotPTM","Mon",23166]
["South Coast","Franly. S","Produce","Manjimup Dried Apples",42002,60,205,2014,12,"Dec","Not YTD","NotPTM","Mon",12300]
["West Coast","Rooney. Y","Seafood","Nord-Ost Matjeshering",42002,25,63,2014,12,"Dec","Not YTD","NotPTM","Mon",1575]
["East Coast","Bonders. P","Meat/Poultry","Pâté chinois",42002,60,41,2014,12,"Dec","Not YTD","NotPTM","Mon",2460]
["South Coast","Lumford. T","Confections","Tarte au sucre",42002,75,238.5,2014,12,"Dec","Not YTD","NotPTM","Mon",17887.5]
["South Coast","Moodley. L","Meat/Poultry","Thüringer Rostbratwurst",42002,100,175.5,2014,12,"Dec","Not YTD","NotPTM","Mon",17550]
["East Coast","Newson. L","Beverages","Côte de Blaye",42003,90,139.5,2014,12,"Dec","Not YTD","NotPTM","Tue",12555]
["East Coast","Perks. M","Seafood","Ikura",42003,87,64.5,2014,12,"Dec","Not YTD","NotPTM","Tue",5611.5]
["West Coast","Stanly. N","Confections","Maxilaku",42003,37,247.5,2014,12,"Dec","Not YTD","NotPTM","Tue",9157.5]
["North Coast","Altercon. C","Confections","NuNuCa Nuß-Nougat-Creme",42003,50,85.5,2014,12,"Dec","Not YTD","NotPTM","Tue",4275]
["West Coast","Numkin. M","Dairy Products","Raclette Courdavault",42003,12,86,2014,12,"Dec","Not YTD","NotPTM","Tue",1032]
["South Coast","Hannis. H","Produce","Rössle Sauerkraut",42003,150,77,2014,12,"Dec","Not YTD","NotPTM","Tue",11550]
["West Coast","Toonly. S","Beverages","Sasquatch Ale",42003,2,82.5,2014,12,"Dec","Not YTD","NotPTM","Tue",165]
["East Coast","Lavin. T","Confections","Teatime Chocolate Biscuits",42003,37,45,2014,12,"Dec","Not YTD","NotPTM","Tue",1665]
["West Coast","Oddesy. Y","Seafood","Boston Crab Meat",42004,25,107.5,2014,12,"Dec","Not YTD","NotPTM","Wed",2687.5]
["North Coast","Connely. K","Beverages","Chang",42004,50,75.5,2014,12,"Dec","Not YTD","NotPTM","Wed",3775]
["East Coast","Anderson. P","Produce","Longlife Tofu",42004,75,72,2014,12,"Dec","Not YTD","NotPTM","Wed",5400]
["North Coast","Atterson. P","Condiments","Louisiana Fiery Hot Pepper Sauce",42004,45,93,2014,12,"Dec","Not YTD","NotPTM","Wed",4185]
["West Coast","Oddesy. Y","Dairy Products","Fløtemysost",42005,169.24866943359376,77,2015,1,"Jan","YTD","NotPTM","Thu",13032.147546386719]
["East Coast","Johnson. A","Grains/Cereals","Gnocchi di nonna Alice",42005,197.45678100585937,136.5,2015,1,"Jan","YTD","NotPTM","Thu",26952.850607299803]
["South Coast","Grooner. T","Condiments","Louisiana Fiery Hot Pepper Sauce",42005,56.416223144531244,75.5,2015,1,"Jan","YTD","NotPTM","Thu",4259.4248474121086]
["East Coast","Anderson. P","Confections","Maxilaku",42005,84.624334716796881,72,2015,1,"Jan","YTD","NotPTM","Thu",6092.9520996093752]
["South Coast","Franly. S","Seafood","Nord-Ost Matjeshering",42005,50.774600830078121,93,2015,1,"Jan","YTD","NotPTM","Thu",4722.0378771972655]
["North Coast","Naidoo. L","Beverages","Steeleye Stout",42005,99.292552734374979,64.5,2015,1,"Jan","YTD","NotPTM","Thu",6404.3696513671857]
["West Coast","Numkin. M","Meat/Poultry","Thüringer Rostbratwurst",42005,59.801196533203111,445.5,2015,1,"Jan","YTD","NotPTM","Thu",26641.433055541987]
["East Coast","Peters. K","Grains/Cereals","Tunnbröd",42006,169.24866943359376,32,2015,1,"Jan","YTD","NotPTM","Fri",5415.9574218750004]
["South Coast","Hannis. H","Condiments","Vegie-spread",42006,183.91688745117187,157.5,2015,1,"Jan","YTD","NotPTM","Fri",28966.909773559571]
["South Coast","Jarison. P","Confections","Chocolade",42007,197.45678100585937,45.5,2015,1,"Jan","YTD","NotPTM","Sat",8984.2835357666008]
["South Coast","Ilknis. K","Confections","Gumbär Gummibärchen",42007,84.624334716796881,112,2015,1,"Jan","YTD","NotPTM","Sat",9477.9254882812511]
["North Coast","Petty. A","Confections","Maxilaku",42007,84.624334716796881,72,2015,1,"Jan","YTD","NotPTM","Sat",6092.9520996093752]
["East Coast","Bonders. P","Confections","Pavlova",42007,59.801196533203111,62.5,2015,1,"Jan","YTD","NotPTM","Sat",3737.5747833251944]
["East Coast","Newson. L","Grains/Cereals","Singaporean Hokkien Fried Mee",42007,112.83244628906249,50,2015,1,"Jan","YTD","NotPTM","Sat",5641.6223144531241]
["North Coast","Oxford. D","Condiments","Aniseed Syrup",42010,141.04055786132813,36,2015,1,"Jan","YTD","NotPTM","Tue",5077.4600830078125]
["East Coast","Lavin. T","Seafood","Boston Crab Meat",42011,5.6416223144531248,66,2015,1,"Jan","YTD","NotPTM","Wed",372.34707275390622]
["East Coast","Anderson. P","Beverages","Chai",42011,28.208111572265622,64.5,2015,1,"Jan","YTD","NotPTM","Wed",1819.4231964111327]
["South Coast","Kinsly. N","Dairy Products","Fløtemysost",42011,42.876329589843742,77,2015,1,"Jan","YTD","NotPTM","Wed",3301.4773784179683]
["East Coast","Johnson. A","Dairy Products","Gudbrandsdalsost",42011,42.876329589843742,129.5,2015,1,"Jan","YTD","NotPTM","Wed",5552.4846818847645]
["East Coast","Perks. M","Seafood","Inlagd Sill",42011,14.668218017578123,68,2015,1,"Jan","YTD","NotPTM","Wed",997.43882519531235]
["East Coast","Peters. K","Dairy Products","Queso Cabrales",42011,84.624334716796881,75.5,2015,1,"Jan","YTD","NotPTM","Wed",6389.1372711181648]
["North Coast","Altercon. C","Produce","Rössle Sauerkraut",42011,118.4740686035156,163.5,2015,1,"Jan","YTD","NotPTM","Wed",19370.5102166748]
["West Coast","Pursly. U","Confections","Sir Rodney's Scones",42011,84.624334716796881,36,2015,1,"Jan","YTD","NotPTM","Wed",3046.4760498046876]
["South Coast","Lumford. T","Seafood","Gravad lax",42012,28.208111572265622,93.5,2015,1,"Jan","YTD","NotPTM","Thu",2637.4584320068357]
["West Coast","Rooney. Y","Confections","Tarte au sucre",42012,99.292552734374979,177,2015,1,"Jan","YTD","NotPTM","Thu",17574.781833984372]
["North Coast","Atterson. P","Meat/Poultry","Tourtière",42012,16.924866943359373,26.5,2015,1,"Jan","YTD","NotPTM","Thu",448.5089739990234]
["North Coast","Connely. K","Confections","Sir Rodney's Scones",42013,33.849733886718745,36,2015,1,"Jan","YTD","NotPTM","Fri",1218.5904199218749]
["West Coast","Stanly. N","Produce","Tofu",42013,33.849733886718745,83.5,2015,1,"Jan","YTD","NotPTM","Fri",2826.4527795410154]
["North Coast","Edford. O","Dairy Products","Geitost",42014,138.78390893554686,9,2015,1,"Jan","YTD","NotPTM","Sat",1249.0551804199217]
["South Coast","Moodley. L","Condiments","Gula Malacca",42014,112.83244628906249,69.5,2015,1,"Jan","YTD","NotPTM","Sat",7841.8550170898434]
["West Coast","Toonly. S","Seafood","Jack's New England Clam Chowder",42014,71.084441162109357,34.5,2015,1,"Jan","YTD","NotPTM","Sat",2452.4132200927729]
["North Coast","Dinnel. M","Dairy Products","Raclette Courdavault",42014,71.084441162109357,198,2015,1,"Jan","YTD","NotPTM","Sat",14074.719350097652]
["North Coast","Oxford. D","Produce","Tofu",42017,56.416223144531244,83.5,2015,1,"Jan","YTD","NotPTM","Tue",4710.7546325683588]
["East Coast","Bonders. P","Beverages","Chai",42018,67.69946777343749,64.5,2015,1,"Jan","YTD","NotPTM","Wed",4366.6156713867185]
["West Coast","Oddesy. Y","Dairy Products","Geitost",42018,141.04055786132813,9,2015,1,"Jan","YTD","NotPTM","Wed",1269.3650207519531]
["West Coast","Numkin. M","Beverages","Lakkalikööri",42018,39.491356201171875,64.5,2015,1,"Jan","YTD","NotPTM","Wed",2547.1924749755858]
["North Coast","Atterson. P","Confections","Tarte au sucre",42018,112.83244628906249,177,2015,1,"Jan","YTD","NotPTM","Wed",19971.34299316406]
["North Coast","Altercon. C","Confections","Teatime Chocolate Biscuits",42018,50.774600830078121,32.5,2015,1,"Jan","YTD","NotPTM","Wed",1650.174526977539]
["South Coast","Franly. S","Meat/Poultry","Alice Mutton",42019,5.6416223144531248,140,2015,1,"Jan","YTD","NotPTM","Thu",789.82712402343748]
["West Coast","Pursly. U","Dairy Products","Geitost",42019,56.416223144531244,9,2015,1,"Jan","YTD","NotPTM","Thu",507.74600830078123]
["East Coast","Perks. M","Beverages","Côte de Blaye",42020,141.04055786132813,948.5,2015,1,"Jan","YTD","NotPTM","Fri",133776.96913146973]
["East Coast","Lavin. T","Condiments","Original Frankfurter grüne Soße",42020,99.292552734374979,46.5,2015,1,"Jan","YTD","NotPTM","Fri",4617.1037021484362]
["North Coast","Dinnel. M","Meat/Poultry","Perth Pasties",42020,28.208111572265622,117.5,2015,1,"Jan","YTD","NotPTM","Fri",3314.4531097412105]
["South Coast","Grooner. T","Grains/Cereals","Ravioli Angelo",42020,56.416223144531244,70,2015,1,"Jan","YTD","NotPTM","Fri",3949.135620117187]
["West Coast","Rooney. Y","Confections","Scottish Longbreads",42020,101.54920166015624,45,2015,1,"Jan","YTD","NotPTM","Fri",4569.7140747070307]
["North Coast","Connely. K","Seafood","Spegesild",42020,5.6416223144531248,43,{"$f":"YEAR(E1092)","v":2015},{"$f":"MONTH(E1092)","v":1},{"$f":"TEXT(E1092,\"mmm\")","v":"Jan"},{"$f":"IF(I1092<MONTH(TODAY()),\"YTD\",\"Not YTD\")","v":"YTD"},{"$f":"IF(AND(E1092>=EarliestDate,E1092<=MostRecentDate),\"Past12Months\",\"NotPTM\")","v":"NotPTM"},{"$f":"TEXT(E1092,\"ddd\")","v":"Fri"},{"$f":"F1092*G1092","v":242.58975952148435}]
["East Coast","Newson. L","Confections","Teatime Chocolate Biscuits",42020,56.416223144531244,32.5,2015,1,"Jan","YTD","NotPTM","Fri",1833.5272521972654]
["South Coast","Ilknis. K","Beverages","Chang",42021,169.24866943359376,68,2015,1,"Jan","YTD","NotPTM","Sat",11508.909521484376]
["North Coast","Edford. O","Produce","Longlife Tofu",42021,42.876329589843742,36,2015,1,"Jan","YTD","NotPTM","Sat",1543.5478652343747]
["South Coast","Hannis. H","Condiments","Sirop d'érable",42021,45.132978515624998,102.5,2015,1,"Jan","YTD","NotPTM","Sat",4626.1302978515623]
["North Coast","Oxford. D","Confections","Zaanse koeken",42021,155.70877587890627,34,2015,1,"Jan","YTD","NotPTM","Sat",5294.0983798828129]
["North Coast","Atterson. P","Dairy Products","Camembert Pierrot",42024,169.24866943359376,122,2015,1,"Jan","YTD","NotPTM","Tue",20648.33767089844]
["North Coast","Altercon. C","Dairy Products","Gudbrandsdalsost",42024,56.416223144531244,129.5,2015,1,"Jan","YTD","NotPTM","Tue",7305.9008972167958]
["South Coast","Kinsly. N","Confections","Gumbär Gummibärchen",42025,84.624334716796881,112,2015,1,"Jan","YTD","NotPTM","Wed",9477.9254882812511]
["West Coast","Stanly. N","Seafood","Konbu",42025,5.6416223144531248,21.5,2015,1,"Jan","YTD","NotPTM","Wed",121.29487976074218]
["West Coast","Oddesy. Y","Meat/Poultry","Mishi Kobe Niku",42025,56.416223144531244,349,2015,1,"Jan","YTD","NotPTM","Wed",19689.261877441404]
["West Coast","Toonly. S","Condiments","Original Frankfurter grüne Soße",42025,28.208111572265622,46.5,2015,1,"Jan","YTD","NotPTM","Wed",1311.6771881103514]
["South Coast","Jarison. P","Beverages","Outback Lager",42025,22.566489257812499,54,2015,1,"Jan","YTD","NotPTM","Wed",1218.5904199218749]
["West Coast","Numkin. M","Meat/Poultry","Perth Pasties",42025,42.876329589843742,117.5,2015,1,"Jan","YTD","NotPTM","Wed",5037.96872680664]
["East Coast","Johnson. A","Seafood","Röd Kaviar",42025,56.416223144531244,54,2015,1,"Jan","YTD","NotPTM","Wed",3046.4760498046871]
["East Coast","Anderson. P","Confections","Teatime Chocolate Biscuits",42025,11.28324462890625,32.5,2015,1,"Jan","YTD","NotPTM","Wed",366.7054504394531]
["East Coast","Peters. K","Confections","Gumbär Gummibärchen",42026,5.6416223144531248,112,2015,1,"Jan","YTD","NotPTM","Thu",631.86169921875]
["West Coast","Pursly. U","Beverages","Côte de Blaye",42027,138.78390893554686,948.5,2015,1,"Jan","YTD","NotPTM","Fri",131636.53762536621]
["East Coast","Bonders. P","Dairy Products","Gorgonzola Telino",42027,39.491356201171875,45,2015,1,"Jan","YTD","NotPTM","Fri",1777.1110290527345]
["South Coast","Lumford. T","Dairy Products","Raclette Courdavault",42027,56.416223144531244,198,2015,1,"Jan","YTD","NotPTM","Fri",11170.412182617187]
["North Coast","Connely. K","Confections","Scottish Longbreads",42027,84.624334716796881,45,2015,1,"Jan","YTD","NotPTM","Fri",3808.0950622558598]
["West Coast","Rooney. Y","Beverages","Steeleye Stout",42027,169.24866943359376,64.5,2015,1,"Jan","YTD","NotPTM","Fri",10916.539178466797]
["North Coast","Dinnel. M","Beverages","Lakkalikööri",42028,56.416223144531244,64.5,2015,1,"Jan","YTD","NotPTM","Sat",3638.8463928222654]
["East Coast","Newson. L","Meat/Poultry","Pâté chinois",42028,28.208111572265622,86,2015,1,"Jan","YTD","NotPTM","Sat",2425.8975952148435]
["South Coast","Moodley. L","Grains/Cereals","Gnocchi di nonna Alice",42031,14.668218017578123,136.5,2015,1,"Jan","YTD","NotPTM","Tue",2002.2117593994139]
["South Coast","Grooner. T","Produce","Tofu",42031,99.292552734374979,83.5,2015,1,"Jan","YTD","NotPTM","Tue",8290.9281533203102]
["South Coast","Franly. S","Grains/Cereals","Wimmers gute Semmelknödel",42031,20.30984033203125,119.5,2015,1,"Jan","YTD","NotPTM","Tue",2427.0259196777342]
["West Coast","Stanly. N","Seafood","Spegesild",42032,56.416223144531244,43,2015,1,"Jan","YTD","NotPTM","Wed",2425.8975952148435]
["West Coast","Toonly. S","Confections","Valkoinen suklaa",42033,112.83244628906249,58.5,2015,1,"Jan","YTD","NotPTM","Thu",6600.6981079101552]
["North Coast","Edford. O","Condiments","Vegie-spread",42033,99.292552734374979,157.5,2015,1,"Jan","YTD","NotPTM","Thu",15638.57705566406]
["West Coast","Oddesy. Y","Meat/Poultry","Alice Mutton",42034,268.54122216796867,140,2015,1,"Jan","YTD","NotPTM","Fri",37595.771103515617]
["North Coast","Oxford. D","Seafood","Boston Crab Meat",42034,141.04055786132813,66,2015,1,"Jan","YTD","NotPTM","Fri",9308.6768188476563]
["East Coast","Lavin. T","Grains/Cereals","Gnocchi di nonna Alice",42034,84.624334716796881,136.5,2015,1,"Jan","YTD","NotPTM","Fri",11551.221688842774]
["North Coast","Altercon. C","Dairy Products","Raclette Courdavault",42034,197.45678100585937,198,2015,1,"Jan","YTD","NotPTM","Fri",39096.442639160152]
["South Coast","Hannis. H","Confections","Sir Rodney's Scones",42034,141.04055786132813,36,2015,1,"Jan","YTD","NotPTM","Fri",5077.4600830078125]
["West Coast","Numkin. M","Confections","Zaanse koeken",42034,84.624334716796881,34,2015,1,"Jan","YTD","NotPTM","Fri",2877.2273803710941]
["South Coast","Ilknis. K","Confections","Gumbär Gummibärchen",42035,28.208111572265622,112,2015,1,"Jan","YTD","NotPTM","Sat",3159.3084960937495]
["East Coast","Perks. M","Meat/Poultry","Tourtière",42035,112.83244628906249,26.5,2015,1,"Jan","YTD","NotPTM","Sat",2990.059826660156]
["North Coast","Atterson. P","Grains/Cereals","Gnocchi di nonna Alice",42038,105.81416015625003,136.5,2015,2,"Feb","YTD","NotPTM","Tue",14443.632861328129]
["West Coast","Rooney. Y","Beverages","Lakkalikööri",42038,68.023388671874997,64.5,2015,2,"Feb","YTD","NotPTM","Tue",4387.508569335937]
["West Coast","Pursly. U","Dairy Products","Queso Cabrales",42038,22.674462890625001,75.5,2015,2,"Feb","YTD","NotPTM","Tue",1711.9219482421877]
["North Coast","Connely. K","Beverages","Chang",42039,37.790771484375,68,2015,2,"Feb","YTD","NotPTM","Wed",2569.7724609375]
["East Coast","Anderson. P","Grains/Cereals","Gustaf's Knäckebröd",42039,45.348925781250003,75.5,2015,2,"Feb","YTD","NotPTM","Wed",3423.8438964843754]
["West Coast","Stanly. N","Dairy Products","Mozzarella di Giovanni",42039,37.790771484375,125,2015,2,"Feb","YTD","NotPTM","Wed",4723.846435546875]
["South Coast","Lumford. T","Grains/Cereals","Gnocchi di nonna Alice",42040,151.1630859375,136.5,2015,2,"Feb","YTD","NotPTM","Thu",20633.76123046875]
["East Coast","Johnson. A","Meat/Poultry","Perth Pasties",42040,57.441972656250002,117.5,2015,2,"Feb","YTD","NotPTM","Thu",6749.4317871093754]
["South Coast","Jarison. P","Beverages","Rhönbräu Klosterbier",42040,90.697851562500006,27.5,2015,2,"Feb","YTD","NotPTM","Thu",2494.19091796875]
["North Coast","Dinnel. M","Seafood","Spegesild",42040,19.651201171874998,43,2015,2,"Feb","YTD","NotPTM","Thu",845.00165039062495]
["South Coast","Kinsly. N","Grains/Cereals","Wimmers gute Semmelknödel",42040,113.37231445312501,119.5,2015,2,"Feb","YTD","NotPTM","Thu",13547.991577148439]
["North Coast","Edford. O","Grains/Cereals","Ravioli Angelo",42041,57.441972656250002,70,2015,2,"Feb","YTD","NotPTM","Fri",4020.9380859375001]
["East Coast","Peters. K","Beverages","Sasquatch Ale",42041,75.58154296875,50,2015,2,"Feb","YTD","NotPTM","Fri",3779.0771484375]
["South Coast","Moodley. L","Confections","Teatime Chocolate Biscuits",42041,57.441972656250002,32.5,2015,2,"Feb","YTD","NotPTM","Fri",1866.8641113281251]
["North Coast","Altercon. C","Produce","Longlife Tofu",42042,113.37231445312501,36,2015,2,"Feb","YTD","NotPTM","Sat",4081.4033203125005]
["North Coast","Oxford. D","Confections","Pavlova",42042,60.465234375000001,62.5,2015,2,"Feb","YTD","NotPTM","Sat",3779.0771484375]
["West Coast","Toonly. S","Dairy Products","Queso Manchego La Pastora",42042,57.441972656250002,136.5,2015,2,"Feb","YTD","NotPTM","Sat",7840.8292675781249]
["East Coast","Bonders. P","Grains/Cereals","Wimmers gute Semmelknödel",42042,22.674462890625001,119.5,2015,2,"Feb","YTD","NotPTM","Sat",2709.5983154296878]
["East Coast","Newson. L","Beverages","Chang",42045,170.81428710937502,68,2015,2,"Feb","YTD","NotPTM","Tue",11615.371523437501]
["East Coast","Lavin. T","Confections","Pavlova",42045,185.93059570312502,62.5,2015,2,"Feb","YTD","NotPTM","Tue",11620.662231445314]
["West Coast","Numkin. M","Confections","Schoggi Schokolade",42045,188.953857421875,157.5,2015,2,"Feb","YTD","NotPTM","Tue",29760.232543945313]
["East Coast","Perks. M","Condiments","Sirop d'érable",42045,340.116943359375,102.5,2015,2,"Feb","YTD","NotPTM","Tue",34861.986694335938]
["North Coast","Atterson. P","Meat/Poultry","Thüringer Rostbratwurst",42045,90.697851562500006,445.5,2015,2,"Feb","YTD","NotPTM","Tue",40405.892871093754]
["East Coast","Anderson. P","Condiments","Louisiana Hot Spiced Okra",42046,226.74462890625003,61,2015,2,"Feb","YTD","NotPTM","Wed",13831.422363281252]
["West Coast","Oddesy. Y","Dairy Products","Queso Cabrales",42046,113.37231445312501,75.5,2015,2,"Feb","YTD","NotPTM","Wed",8559.6097412109393]
["South Coast","Franly. S","Meat/Poultry","Tourtière",42046,302.326171875,26.5,2015,2,"Feb","YTD","NotPTM","Wed",8011.6435546875]
["East Coast","Johnson. A","Meat/Poultry","Alice Mutton",42047,37.790771484375,140,{"$f":"YEAR(E1156)","v":2015},{"$f":"MONTH(E1156)","v":2},{"$f":"TEXT(E1156,\"mmm\")","v":"Feb"},{"$f":"IF(I1156<MONTH(TODAY()),\"YTD\",\"Not YTD\")","v":"YTD"},{"$f":"IF(AND(E1156>=EarliestDate,E1156<=MostRecentDate),\"Past12Months\",\"NotPTM\")","v":"NotPTM"},{"$f":"TEXT(E1156,\"ddd\")","v":"Thu"},{"$f":"F1156*G1156","v":5290.7080078125}]
["East Coast","Peters. K","Confections","Gumbär Gummibärchen",42047,57.441972656250002,112,2015,2,"Feb","YTD","NotPTM","Thu",6433.5009375]
["East Coast","Bonders. P","Seafood","Jack's New England Clam Chowder",42047,113.37231445312501,34.5,2015,2,"Feb","YTD","NotPTM","Thu",3911.344848632813]
["South Coast","Grooner. T","Dairy Products","Queso Cabrales",42047,22.674462890625001,75.5,2015,2,"Feb","YTD","NotPTM","Thu",1711.9219482421877]
["South Coast","Hannis. H","Produce","Rössle Sauerkraut",42047,45.348925781250003,163.5,2015,2,"Feb","YTD","NotPTM","Thu",7414.5493652343757]
["North Coast","Connely. K","Beverages","Steeleye Stout",42047,30.232617187500001,64.5,2015,2,"Feb","YTD","NotPTM","Thu",1950.0038085937501]
["North Coast","Dinnel. M","Beverages","Chartreuse verte",42048,22.674462890625001,64.5,2015,2,"Feb","YTD","NotPTM","Fri",1462.5028564453125]
["South Coast","Ilknis. K","Meat/Poultry","Tourtière",42048,57.441972656250002,26.5,2015,2,"Feb","YTD","NotPTM","Fri",1522.2122753906251]
["North Coast","Edford. O","Grains/Cereals","Filo Mix",42049,57.441972656250002,25,2015,2,"Feb","YTD","NotPTM","Sat",1436.04931640625]
["South Coast","Jarison. P","Dairy Products","Fløtemysost",42049,7.5581542968750002,77,2015,2,"Feb","YTD","NotPTM","Sat",581.97788085937498]
["West Coast","Pursly. U","Dairy Products","Gorgonzola Telino",42049,12.093046875000001,45,2015,2,"Feb","YTD","NotPTM","Sat",544.18710937499998]
["South Coast","Kinsly. N","Beverages","Guaraná Fantástica",42049,75.58154296875,16,2015,2,"Feb","YTD","NotPTM","Sat",1209.3046875]
["West Coast","Rooney. Y","Condiments","Louisiana Fiery Hot Pepper Sauce",42049,133.02351562499999,75.5,2015,2,"Feb","YTD","NotPTM","Sat",10043.275429687499]
["South Coast","Lumford. T","Confections","Teatime Chocolate Biscuits",42049,196.51201171875005,32.5,2015,2,"Feb","YTD","NotPTM","Sat",6386.6403808593768]
["North Coast","Oxford. D","Seafood","Boston Crab Meat",42052,75.58154296875,66,2015,2,"Feb","YTD","NotPTM","Tue",4988.3818359375]
["West Coast","Stanly. N","Confections","Gumbär Gummibärchen",42052,22.674462890625001,112,2015,2,"Feb","YTD","NotPTM","Tue",2539.5398437500003]
["West Coast","Toonly. S","Grains/Cereals","Filo Mix",42053,75.58154296875,25,2015,2,"Feb","YTD","NotPTM","Wed",1889.53857421875]
["South Coast","Moodley. L","Seafood","Ikura",42053,52.907080078125013,111.5,2015,2,"Feb","YTD","NotPTM","Wed",5899.1394287109388]
["East Coast","Newson. L","Confections","Tarte au sucre",42053,133.02351562499999,177,2015,2,"Feb","YTD","NotPTM","Wed",23545.162265624997]
["East Coast","Perks. M","Seafood","Ikura",42054,75.58154296875,111.5,2015,2,"Feb","YTD","NotPTM","Thu",8427.342041015625]
["West Coast","Numkin. M","Condiments","Louisiana Fiery Hot Pepper Sauce",42054,105.81416015625003,75.5,2015,2,"Feb","YTD","NotPTM","Thu",7988.9690917968774]
["West Coast","Oddesy. Y","Condiments","Original Frankfurter grüne Soße",42054,208.60505859375004,46.5,2015,2,"Feb","YTD","NotPTM","Thu",9700.1352246093775]
["North Coast","Altercon. C","Meat/Poultry","Pâté chinois",42054,453.48925781250006,86,2015,2,"Feb","YTD","NotPTM","Thu",39000.076171875007]
["East Coast","Lavin. T","Meat/Poultry","Tourtière",42054,22.674462890625001,26.5,2015,2,"Feb","YTD","NotPTM","Thu",600.87326660156259]
["South Coast","Franly. S","Grains/Cereals","Wimmers gute Semmelknödel",42054,133.02351562499999,119.5,2015,2,"Feb","YTD","NotPTM","Thu",15896.310117187499]
["East Coast","Anderson. P","Condiments","Gula Malacca",42055,377.90771484375,69.5,2015,2,"Feb","YTD","NotPTM","Fri",26264.586181640625]
["West Coast","Pursly. U","Produce","Rössle Sauerkraut",42055,57.441972656250002,163.5,2015,2,"Feb","YTD","NotPTM","Fri",9391.7625292968751]
["East Coast","Johnson. A","Confections","Chocolade",42056,57.441972656250002,45.5,2015,2,"Feb","YTD","NotPTM","Sat",2613.6097558593751]
["North Coast","Atterson. P","Dairy Products","Geitost",42056,75.58154296875,9,2015,2,"Feb","YTD","NotPTM","Sat",680.23388671875]
["East Coast","Peters. K","Beverages","Outback Lager",42056,95.232744140625002,54,2015,2,"Feb","YTD","NotPTM","Sat",5142.5681835937503]
["South Coast","Hannis. H","Confections","Pavlova",42056,75.58154296875,62.5,2015,2,"Feb","YTD","NotPTM","Sat",4723.846435546875]
["South Coast","Grooner. T","Seafood","Spegesild",42056,37.790771484375,43,2015,2,"Feb","YTD","NotPTM","Sat",1625.003173828125]
["West Coast","Rooney. Y","Beverages","Chartreuse verte",42059,75.58154296875,64.5,2015,2,"Feb","YTD","NotPTM","Tue",4875.009521484375]
["South Coast","Jarison. P","Dairy Products","Fløtemysost",42059,113.37231445312501,77,2015,2,"Feb","YTD","NotPTM","Tue",8729.6682128906268]
["East Coast","Bonders. P","Meat/Poultry","Perth Pasties",42059,188.953857421875,117.5,2015,2,"Feb","YTD","NotPTM","Tue",22202.078247070313]
["South Coast","Ilknis. K","Condiments","Sirop d'érable",42059,95.232744140625002,102.5,2015,2,"Feb","YTD","NotPTM","Tue",9761.3562744140618]
["South Coast","Kinsly. N","Confections","Maxilaku",42060,80.116435546874996,72,2015,2,"Feb","YTD","NotPTM","Wed",5768.3833593749996]
["East Coast","Newson. L","Dairy Products","Raclette Courdavault",42060,136.04677734374999,198,2015,2,"Feb","YTD","NotPTM","Wed",26937.261914062499]
["North Coast","Connely. K","Confections","Sir Rodney's Scones",42060,151.1630859375,36,2015,2,"Feb","YTD","NotPTM","Wed",5441.87109375]
["South Coast","Moodley. L","Dairy Products","Fløtemysost",42061,188.953857421875,77,2015,2,"Feb","YTD","NotPTM","Thu",14549.447021484375]
["South Coast","Lumford. T","Grains/Cereals","Gnocchi di nonna Alice",42061,57.441972656250002,136.5,2015,2,"Feb","YTD","NotPTM","Thu",7840.8292675781249]
["North Coast","Dinnel. M","Confections","Gumbär Gummibärchen",42061,113.37231445312501,112,2015,2,"Feb","YTD","NotPTM","Thu",12697.699218750002]
["East Coast","Lavin. T","Beverages","Ipoh Coffee",42061,75.58154296875,165.5,2015,2,"Feb","YTD","NotPTM","Thu",12508.745361328125]
["West Coast","Stanly. N","Produce","Rössle Sauerkraut",42061,113.37231445312501,163.5,2015,2,"Feb","YTD","NotPTM","Thu",18536.373413085941]
["West Coast","Numkin. M","Dairy Products","Mozzarella di Giovanni",42062,151.1630859375,125,2015,2,"Feb","YTD","NotPTM","Fri",18895.3857421875]
["South Coast","Franly. S","Seafood","Spegesild",42062,75.58154296875,43,2015,2,"Feb","YTD","NotPTM","Fri",3250.00634765625]
["West Coast","Toonly. S","Produce","Uncle Bob's Organic Dried Pears",42062,60.465234375000001,108,2015,2,"Feb","YTD","NotPTM","Fri",6530.2453125000002]
["East Coast","Perks. M","Seafood","Nord-Ost Matjeshering",42063,105.81416015625003,93,2015,2,"Feb","YTD","NotPTM","Sat",9840.7168945312533]
["South Coast","Hannis. H","Meat/Poultry","Pâté chinois",42063,226.74462890625003,86,2015,2,"Feb","YTD","NotPTM","Sat",19500.038085937504]
["South Coast","Grooner. T","Beverages","Rhönbräu Klosterbier",42063,15.11630859375,27.5,2015,2,"Feb","YTD","NotPTM","Sat",415.698486328125]
["North Coast","Edford. O","Confections","Scottish Longbreads",42063,80.116435546874996,45,2015,2,"Feb","YTD","NotPTM","Sat",3605.2395996093746]
["East Coast","Anderson. P","Confections","Sir Rodney's Scones",42063,151.1630859375,36,2015,2,"Feb","YTD","NotPTM","Sat",5441.87109375]
["West Coast","Oddesy. Y","Seafood","Konbu",42066,4.9667871093749989,21.5,2015,3,"Mar","YTD","NotPTM","Tue",106.78592285156247]
["West Coast","Pursly. U","Grains/Cereals","Tunnbröd",42066,87.746572265624977,32,2015,3,"Mar","YTD","NotPTM","Tue",2807.8903124999993]
["North Coast","Oxford. D","Dairy Products","Camembert Pierrot",42067,82.77978515625,122,2015,3,"Mar","YTD","NotPTM","Wed",10099.1337890625]
["East Coast","Peters. K","Condiments","Chef Anton's Cajun Seasoning",42067,66.223828124999997,79,2015,3,"Mar","YTD","NotPTM","Wed",5231.6824218749998]
["East Coast","Newson. L","Grains/Cereals","Gnocchi di nonna Alice",42067,124.169677734375,136.5,2015,3,"Mar","YTD","NotPTM","Wed",16949.161010742188]
["East Coast","Johnson. A","Beverages","Ipoh Coffee",42067,13.244765624999999,165.5,2015,3,"Mar","YTD","NotPTM","Wed",2192.0087109374999]
["North Coast","Altercon. C","Grains/Cereals","Singaporean Hokkien Fried Mee",42067,206.94946289062497,50,2015,3,"Mar","YTD","NotPTM","Wed",10347.473144531248]
["East Coast","Bonders. P","Confections","Teatime Chocolate Biscuits",42067,87.746572265624977,32.5,2015,3,"Mar","YTD","NotPTM","Wed",2851.7635986328119]
["West Coast","Rooney. Y","Seafood","Boston Crab Meat",42068,82.77978515625,66,2015,3,"Mar","YTD","NotPTM","Thu",5463.4658203125]
["North Coast","Atterson. P","Beverages","Guaraná Fantástica",42068,104.30252929687498,16,2015,3,"Mar","YTD","NotPTM","Thu",1668.8404687499997]
["South Coast","Ilknis. K","Seafood","Røgede sild",42068,124.169677734375,34,2015,3,"Mar","YTD","NotPTM","Thu",4221.76904296875]
["East Coast","Lavin. T","Meat/Poultry","Thüringer Rostbratwurst",42068,74.501806640624991,445.5,2015,3,"Mar","YTD","NotPTM","Thu",33190.554858398435]
["West Coast","Stanly. N","Confections","Valkoinen suklaa",42068,104.30252929687498,58.5,{"$f":"YEAR(E1220)","v":2015},{"$f":"MONTH(E1220)","v":3},{"$f":"TEXT(E1220,\"mmm\")","v":"Mar"},{"$f":"IF(I1220<MONTH(TODAY()),\"YTD\",\"Not YTD\")","v":"YTD"},{"$f":"IF(AND(E1220>=EarliestDate,E1220<=MostRecentDate),\"Past12Months\",\"NotPTM\")","v":"NotPTM"},{"$f":"TEXT(E1220,\"ddd\")","v":"Thu"},{"$f":"F1220*G1220","v":6101.6979638671864}]
["South Coast","Jarison. P","Beverages","Guaraná Fantástica",42069,115.89169921875001,16,2015,3,"Mar","YTD","NotPTM","Fri",1854.2671875000001]
["North Coast","Dinnel. M","Confections","NuNuCa Nuß-Nougat-Creme",42069,49.667871093749994,50,2015,3,"Mar","YTD","NotPTM","Fri",2483.3935546874995]
["North Coast","Connely. K","Dairy Products","Queso Cabrales",42069,41.389892578125,75.5,2015,3,"Mar","YTD","NotPTM","Fri",3124.9368896484375]
["West Coast","Toonly. S","Seafood","Spegesild",42069,21.522744140624997,43,2015,3,"Mar","YTD","NotPTM","Fri",925.47799804687486]
["North Coast","Edford. O","Beverages","Ipoh Coffee",42070,62.912636718749994,165.5,2015,3,"Mar","YTD","NotPTM","Sat",10412.041376953124]
["West Coast","Numkin. M","Seafood","Nord-Ost Matjeshering",42070,33.111914062499999,93,2015,3,"Mar","YTD","NotPTM","Sat",3079.4080078124998]
["South Coast","Kinsly. N","Beverages","Chang",42073,165.5595703125,68,2015,3,"Mar","YTD","NotPTM","Tue",11258.05078125]
["North Coast","Oxford. D","Condiments","Gula Malacca",42073,8.2779785156249996,69.5,2015,3,"Mar","YTD","NotPTM","Tue",575.31950683593743]
["North Coast","Altercon. C","Confections","Pavlova",42073,145.69242187499998,62.5,2015,3,"Mar","YTD","NotPTM","Tue",9105.7763671874982]
["North Coast","Connely. K","Seafood","Carnarvon Tigers",42074,124.169677734375,225,2015,3,"Mar","YTD","NotPTM","Wed",27938.177490234375]
["East Coast","Anderson. P","Grains/Cereals","Gnocchi di nonna Alice",42074,82.77978515625,136.5,2015,3,"Mar","YTD","NotPTM","Wed",11299.440673828125]
["West Coast","Oddesy. Y","Grains/Cereals","Tunnbröd",42074,62.912636718749994,32,2015,3,"Mar","YTD","NotPTM","Wed",2013.2043749999998]
["North Coast","Atterson. P","Produce","Uncle Bob's Organic Dried Pears",42074,124.169677734375,108,2015,3,"Mar","YTD","NotPTM","Wed",13410.3251953125]
["East Coast","Perks. M","Grains/Cereals","Wimmers gute Semmelknödel",42074,33.111914062499999,119.5,2015,3,"Mar","YTD","NotPTM","Wed",3956.8737304687497]
["North Coast","Dinnel. M","Beverages","Guaraná Fantástica",42075,331.119140625,16,2015,3,"Mar","YTD","NotPTM","Thu",5297.90625]
["South Coast","Lumford. T","Produce","Manjimup Dried Apples",42075,74.501806640624991,190.5,2015,3,"Mar","YTD","NotPTM","Thu",14192.594165039061]
["South Coast","Franly. S","Seafood","Boston Crab Meat",42076,87.746572265624977,66,2015,3,"Mar","YTD","NotPTM","Fri",5791.273769531248]
["East Coast","Johnson. A","Dairy Products","Fløtemysost",42076,49.667871093749994,77,2015,3,"Mar","YTD","NotPTM","Fri",3824.4260742187494]
["West Coast","Rooney. Y","Dairy Products","Geitost",42076,49.667871093749994,9,2015,3,"Mar","YTD","NotPTM","Fri",447.01083984374998]
["West Coast","Pursly. U","Beverages","Rhönbräu Klosterbier",42076,41.389892578125,27.5,2015,3,"Mar","YTD","NotPTM","Fri",1138.2220458984375]
["North Coast","Edford. O","Produce","Rössle Sauerkraut",42076,74.501806640624991,163.5,2015,3,"Mar","YTD","NotPTM","Fri",12181.045385742185]
["South Coast","Moodley. L","Produce","Tofu",42076,49.667871093749994,83.5,2015,3,"Mar","YTD","NotPTM","Fri",4147.2672363281245]
["West Coast","Stanly. N","Dairy Products","Gorgonzola Telino",42077,145.69242187499998,45,2015,3,"Mar","YTD","NotPTM","Sat",6556.1589843749989]
["West Coast","Toonly. S","Beverages","Lakkalikööri",42077,173.83754882812499,64.5,2015,3,"Mar","YTD","NotPTM","Sat",11212.521899414061]
["North Coast","Oxford. D","Condiments","Louisiana Hot Spiced Okra",42077,248.33935546875,61,2015,3,"Mar","YTD","NotPTM","Sat",15148.70068359375]
["East Coast","Peters. K","Beverages","Chai",42080,62.912636718749994,64.5,2015,3,"Mar","YTD","NotPTM","Tue",4057.8650683593746]
["South Coast","Grooner. T","Beverages","Chartreuse verte",42080,82.77978515625,64.5,2015,3,"Mar","YTD","NotPTM","Tue",5339.296142578125]
["North Coast","Altercon. C","Beverages","Outback Lager",42080,49.667871093749994,54,2015,3,"Mar","YTD","NotPTM","Tue",2682.0650390624996]
["West Coast","Numkin. M","Meat/Poultry","Pâté chinois",42080,8.2779785156249996,86,2015,3,"Mar","YTD","NotPTM","Tue",711.90615234375002]
["North Coast","Atterson. P","Confections","Sir Rodney's Scones",42080,87.746572265624977,36,2015,3,"Mar","YTD","NotPTM","Tue",3158.8766015624992]
["North Coast","Connely. K","Seafood","Ikura",42081,82.77978515625,111.5,2015,3,"Mar","YTD","NotPTM","Wed",9229.946044921875]
["West Coast","Oddesy. Y","Beverages","Côte de Blaye",42082,124.169677734375,948.5,2015,3,"Mar","YTD","NotPTM","Thu",117774.93933105469]
["North Coast","Dinnel. M","Meat/Poultry","Perth Pasties",42082,115.89169921875001,117.5,2015,3,"Mar","YTD","NotPTM","Thu",13617.274658203125]
["West Coast","Pursly. U","Dairy Products","Raclette Courdavault",42082,248.33935546875,198,2015,3,"Mar","YTD","NotPTM","Thu",49171.1923828125]
["East Coast","Bonders. P","Grains/Cereals","Wimmers gute Semmelknödel",42082,124.169677734375,119.5,2015,3,"Mar","YTD","NotPTM","Thu",14838.276489257813]
["North Coast","Oxford. D","Dairy Products","Camembert Pierrot",42083,165.5595703125,122,2015,3,"Mar","YTD","NotPTM","Fri",20198.267578125]
["North Coast","Edford. O","Confections","Maxilaku",42083,99.335742187499989,72,2015,3,"Mar","YTD","NotPTM","Fri",7152.1734374999996]
["West Coast","Rooney. Y","Dairy Products","Raclette Courdavault",42083,49.667871093749994,198,2015,3,"Mar","YTD","NotPTM","Fri",9834.2384765624993]
["South Coast","Hannis. H","Confections","Zaanse koeken",42083,124.169677734375,34,2015,3,"Mar","YTD","NotPTM","Fri",4221.76904296875]
["East Coast","Newson. L","Seafood","Boston Crab Meat",42084,41.389892578125,66,2015,3,"Mar","YTD","NotPTM","Sat",2731.73291015625]
["South Coast","Jarison. P","Seafood","Boston Crab Meat",42087,41.389892578125,66,2015,3,"Mar","YTD","NotPTM","Tue",2731.73291015625]
["South Coast","Ilknis. K","Produce","Manjimup Dried Apples",42087,13.244765624999999,190.5,2015,3,"Mar","YTD","NotPTM","Tue",2523.1278515624999]
["North Coast","Atterson. P","Condiments","Original Frankfurter grüne Soße",42087,124.169677734375,46.5,2015,3,"Mar","YTD","NotPTM","Tue",5773.8900146484375]
["East Coast","Lavin. T","Beverages","Sasquatch Ale",42087,145.69242187499998,50,2015,3,"Mar","YTD","NotPTM","Tue",7284.6210937499991]
["North Coast","Altercon. C","Confections","Sir Rodney's Scones",42087,57.945849609375003,36,2015,3,"Mar","YTD","NotPTM","Tue",2086.0505859375003]
["East Coast","Perks. M","Condiments","Aniseed Syrup",42088,82.77978515625,36,2015,3,"Mar","YTD","NotPTM","Wed",2980.072265625]
["West Coast","Stanly. N","Beverages","Chang",42088,82.77978515625,68,2015,3,"Mar","YTD","NotPTM","Wed",5629.025390625]
["East Coast","Anderson. P","Beverages","Outback Lager",42088,248.33935546875,54,2015,3,"Mar","YTD","NotPTM","Wed",13410.3251953125]
["West Coast","Toonly. S","Meat/Poultry","Pâté chinois",42088,124.169677734375,86,2015,3,"Mar","YTD","NotPTM","Wed",10678.59228515625]
["East Coast","Bonders. P","Confections","Gumbär Gummibärchen",42089,124.169677734375,112,2015,3,"Mar","YTD","NotPTM","Thu",13907.00390625]
["South Coast","Lumford. T","Produce","Longlife Tofu",42089,66.223828124999997,36,2015,3,"Mar","YTD","NotPTM","Thu",2384.0578124999997]
["East Coast","Peters. K","Produce","Manjimup Dried Apples",42089,104.30252929687498,190.5,2015,3,"Mar","YTD","NotPTM","Thu",19869.631831054685]
["South Coast","Kinsly. N","Dairy Products","Queso Cabrales",42089,21.522744140624997,75.5,2015,3,"Mar","YTD","NotPTM","Thu",1624.9671826171873]
["East Coast","Johnson. A","Confections","Teatime Chocolate Biscuits",42089,21.522744140624997,32.5,2015,3,"Mar","YTD","NotPTM","Thu",699.48918457031243]
["West Coast","Numkin. M","Meat/Poultry","Tourtière",42089,99.335742187499989,26.5,2015,3,"Mar","YTD","NotPTM","Thu",2632.3971679687497]
["South Coast","Franly. S","Dairy Products","Raclette Courdavault",42090,124.169677734375,198,2015,3,"Mar","YTD","NotPTM","Fri",24585.59619140625]
["South Coast","Moodley. L","Seafood","Röd Kaviar",42090,82.77978515625,54,2015,3,"Mar","YTD","NotPTM","Fri",4470.1083984375]
["West Coast","Oddesy. Y","Confections","Pavlova",42091,74.501806640624991,62.5,2015,3,"Mar","YTD","NotPTM","Sat",4656.3629150390616]
["South Coast","Grooner. T","Dairy Products","Queso Cabrales",42091,62.912636718749994,75.5,2015,3,"Mar","YTD","NotPTM","Sat",4749.9040722656246]
["North Coast","Dinnel. M","Condiments","Gula Malacca",42094,62.912636718749994,69.5,2015,3,"Mar","YTD","NotPTM","Tue",4372.4282519531243]
["North Coast","Connely. K","Condiments","Original Frankfurter grüne Soße",42094,29.800722656249999,46.5,2015,3,"Mar","YTD","NotPTM","Tue",1385.733603515625]
["South Coast","Ilknis. K","Dairy Products","Raclette Courdavault",42094,248.33935546875,198,2015,3,"Mar","YTD","NotPTM","Tue",49171.1923828125]
["South Coast","Hannis. H","Beverages","Rhönbräu Klosterbier",42094,149.00361328124998,27.5,2015,3,"Mar","YTD","NotPTM","Tue",4097.5993652343741]
["North Coast","Edford. O","Confections","Scottish Longbreads",42094,124.169677734375,45,{"$f":"YEAR(E1284)","v":2015},{"$f":"MONTH(E1284)","v":3},{"$f":"TEXT(E1284,\"mmm\")","v":"Mar"},{"$f":"IF(I1284<MONTH(TODAY()),\"YTD\",\"Not YTD\")","v":"YTD"},{"$f":"IF(AND(E1284>=EarliestDate,E1284<=MostRecentDate),\"Past12Months\",\"NotPTM\")","v":"NotPTM"},{"$f":"TEXT(E1284,\"ddd\")","v":"Tue"},{"$f":"F1284*G1284","v":5587.635498046875}]
["North Coast","Altercon. C","Confections","NuNuCa Nuß-Nougat-Creme",42095,161.42058105468752,62.5,2015,4,"Apr","YTD","NotPTM","Wed",10088.786315917971]
["North Coast","Oxford. D","Grains/Cereals","Singaporean Hokkien Fried Mee",42095,53.806860351562499,62.5,2015,4,"Apr","YTD","NotPTM","Wed",3362.9287719726563]
["West Coast","Stanly. N","Grains/Cereals","Gnocchi di nonna Alice",42096,80.710290527343759,170.625,2015,4,"Apr","YTD","NotPTM","Thu",13771.193321228029]
["West Coast","Pursly. U","Dairy Products","Gudbrandsdalsost",42096,26.903430175781249,161.875,2015,4,"Apr","YTD","NotPTM","Thu",4354.9927597045898]
["West Coast","Rooney. Y","Condiments","Louisiana Fiery Hot Pepper Sauce",42096,40.893213867187498,94.375,2015,4,"Apr","YTD","NotPTM","Thu",3859.2970587158202]
["North Coast","Atterson. P","Condiments","Louisiana Hot Spiced Okra",42096,26.903430175781249,76.25,2015,4,"Apr","YTD","NotPTM","Thu",2051.3865509033203]
["West Coast","Toonly. S","Seafood","Jack's New England Clam Chowder",42097,53.806860351562499,43.125,2015,4,"Apr","YTD","NotPTM","Fri",2320.4208526611328]
["North Coast","Connely. K","Condiments","Original Frankfurter grüne Soße",42097,13.989783691406249,58.125,2015,4,"Apr","YTD","NotPTM","Fri",813.15617706298826]
["East Coast","Newson. L","Grains/Cereals","Tunnbröd",42097,26.903430175781249,40,2015,4,"Apr","YTD","NotPTM","Fri",1076.13720703125]
["West Coast","Numkin. M","Grains/Cereals","Gnocchi di nonna Alice",42098,37.66480224609375,170.625,2015,4,"Apr","YTD","NotPTM","Sat",6426.5568832397457]
["East Coast","Lavin. T","Dairy Products","Gorgonzola Telino",42098,53.806860351562499,56.25,2015,4,"Apr","YTD","NotPTM","Sat",3026.6358947753906]
["North Coast","Dinnel. M","Dairy Products","Mozzarella di Giovanni",42098,67.796644042968737,156.25,2015,4,"Apr","YTD","NotPTM","Sat",10593.225631713865]
["South Coast","Jarison. P","Condiments","Original Frankfurter grüne Soße",42098,67.796644042968737,58.125,2015,4,"Apr","YTD","NotPTM","Sat",3940.6799349975577]
["West Coast","Oddesy. Y","Seafood","Boston Crab Meat",42101,13.989783691406249,103.125,2015,4,"Apr","YTD","NotPTM","Tue",1442.6964431762694]
["East Coast","Perks. M","Beverages","Guaraná Fantástica",42101,37.66480224609375,25,2015,4,"Apr","YTD","NotPTM","Tue",941.62005615234375]
["East Coast","Anderson. P","Grains/Cereals","Singaporean Hokkien Fried Mee",42101,80.710290527343759,78.75,2015,4,"Apr","YTD","NotPTM","Tue",6355.9353790283212]
["West Coast","Pursly. U","Confections","Maxilaku",42102,67.796644042968737,112.5,2015,4,"Apr","YTD","NotPTM","Wed",7627.1224548339833]
["South Coast","Kinsly. N","Produce","Rössle Sauerkraut",42102,53.806860351562499,256.25,2015,4,"Apr","YTD","NotPTM","Wed",13788.007965087891]
["East Coast","Johnson. A","Condiments","Genen Shouyu",42103,32.284116210937498,86.875,2015,4,"Apr","YTD","NotPTM","Thu",2804.6825958251952]
["South Coast","Lumford. T","Produce","Rössle Sauerkraut",42103,21.522744140625001,256.25,2015,4,"Apr","YTD","NotPTM","Thu",5515.2031860351563]
["North Coast","Edford. O","Meat/Poultry","Tourtière",42103,53.806860351562499,41.875,2015,4,"Apr","YTD","NotPTM","Thu",2253.1622772216797]
["South Coast","Franly. S","Beverages","Laughing Lumberjack Lager",42104,80.710290527343759,78.75,2015,4,"Apr","YTD","NotPTM","Fri",6355.9353790283212]
["South Coast","Moodley. L","Meat/Poultry","Perth Pasties",42104,16.142058105468749,184.375,2015,4,"Apr","YTD","NotPTM","Fri",2976.1919631958008]
["West Coast","Rooney. Y","Seafood","Røgede sild",42104,57.03527197265624,53.125,2015,4,"Apr","YTD","NotPTM","Fri",3029.9988235473629]
["South Coast","Hannis. H","Beverages","Chang",42105,32.284116210937498,106.875,2015,4,"Apr","YTD","NotPTM","Sat",3450.3649200439449]
["West Coast","Stanly. N","Condiments","Louisiana Fiery Hot Pepper Sauce",42105,53.806860351562499,118.125,2015,4,"Apr","YTD","NotPTM","Sat",6355.9353790283203]
["South Coast","Grooner. T","Meat/Poultry","Perth Pasties",42105,26.903430175781249,184.375,2015,4,"Apr","YTD","NotPTM","Sat",4960.319938659668]
["North Coast","Oxford. D","Confections","Sir Rodney's Scones",42105,32.284116210937498,56.25,2015,4,"Apr","YTD","NotPTM","Sat",1815.9815368652341]
["East Coast","Peters. K","Condiments","Sirop d'érable",42105,67.796644042968737,160,2015,4,"Apr","YTD","NotPTM","Sat",10847.463046874998]
["West Coast","Toonly. S","Produce","Tofu",42105,188.32401123046876,130.625,2015,4,"Apr","YTD","NotPTM","Sat",24599.82396697998]
["North Coast","Altercon. C","Confections","Tarte au sucre",42108,8.6090976562500003,276.875,2015,4,"Apr","YTD","NotPTM","Tue",2383.6439135742189]
["South Coast","Jarison. P","Confections","Chocolade",42109,40.893213867187498,71.25,2015,4,"Apr","YTD","NotPTM","Wed",2913.6414880371094]
["East Coast","Bonders. P","Beverages","Ipoh Coffee",42109,40.893213867187498,258.75,2015,4,"Apr","YTD","NotPTM","Wed",10581.119088134765]
["East Coast","Newson. L","Confections","NuNuCa Nuß-Nougat-Creme",42109,48.426174316406247,78.75,2015,4,"Apr","YTD","NotPTM","Wed",3813.5612274169921]
["South Coast","Ilknis. K","Beverages","Outback Lager",42109,37.66480224609375,84.375,2015,4,"Apr","YTD","NotPTM","Wed",3177.9676895141602]
["North Coast","Atterson. P","Beverages","Chartreuse verte",42110,26.903430175781249,101.25,2015,4,"Apr","YTD","NotPTM","Thu",2723.9723052978516]
["West Coast","Numkin. M","Seafood","Konbu",42110,26.903430175781249,33.75,2015,4,"Apr","YTD","NotPTM","Thu",907.99076843261719]
["West Coast","Oddesy. Y","Produce","Rössle Sauerkraut",42111,8.6090976562500003,256.25,2015,4,"Apr","YTD","NotPTM","Fri",2206.0812744140626]
["West Coast","Rooney. Y","Condiments","Chef Anton's Cajun Seasoning",42112,134.51715087890625,123.75,2015,4,"Apr","YTD","NotPTM","Sat",16646.497421264648]
["East Coast","Lavin. T","Condiments","Northwoods Cranberry Sauce",42112,26.903430175781249,225,2015,4,"Apr","YTD","NotPTM","Sat",6053.2717895507813]
["North Coast","Connely. K","Beverages","Rhönbräu Klosterbier",42112,96.852348632812493,43.125,2015,4,"Apr","YTD","NotPTM","Sat",4176.7575347900383]
["West Coast","Pursly. U","Meat/Poultry","Thüringer Rostbratwurst",42112,96.852348632812493,696.25,2015,4,"Apr","YTD","NotPTM","Sat",67433.447735595691]
["East Coast","Perks. M","Produce","Uncle Bob's Organic Dried Pears",42112,134.51715087890625,168.75,2015,4,"Apr","YTD","NotPTM","Sat",22699.76921081543]
["West Coast","Stanly. N","Dairy Products","Camembert Pierrot",42115,32.284116210937498,191.25,2015,4,"Apr","YTD","NotPTM","Tue",6174.3372253417965]
["South Coast","Kinsly. N","Beverages","Guaraná Fantástica",42115,26.903430175781249,25,2015,4,"Apr","YTD","NotPTM","Tue",672.58575439453125]
["East Coast","Anderson. P","Seafood","Spegesild",42115,24.751155761718749,67.5,2015,4,"Apr","YTD","NotPTM","Tue",1670.7030139160156]
["North Coast","Dinnel. M","Confections","Zaanse koeken",42115,16.142058105468749,53.125,2015,4,"Apr","YTD","NotPTM","Tue",857.54683685302723]
["East Coast","Johnson. A","Grains/Cereals","Gnocchi di nonna Alice",42116,188.32401123046876,213.75,2015,4,"Apr","YTD","NotPTM","Wed",40254.257400512695]
["North Coast","Oxford. D","Condiments","Louisiana Fiery Hot Pepper Sauce",42116,105.46144628906251,118.125,2015,4,"Apr","YTD","NotPTM","Wed",12457.633342895509]
["North Coast","Altercon. C","Dairy Products","Mascarpone Fabioli",42116,134.51715087890625,180,2015,4,"Apr","YTD","NotPTM","Wed",24213.087158203125]
["South Coast","Moodley. L","Beverages","Rhönbräu Klosterbier",42116,134.51715087890625,43.125,2015,4,"Apr","YTD","NotPTM","Wed",5801.052131652832]
["South Coast","Lumford. T","Produce","Rössle Sauerkraut",42116,94.70007421874999,256.25,2015,4,"Apr","YTD","NotPTM","Wed",24266.894018554685]
["West Coast","Toonly. S","Confections","Sir Rodney's Marmalade",42116,105.46144628906251,455.625,2015,4,"Apr","YTD","NotPTM","Wed",48050.871465454104]
["West Coast","Numkin. M","Confections","Sir Rodney's Scones",42116,107.613720703125,56.25,2015,4,"Apr","YTD","NotPTM","Wed",6053.2717895507813]
["North Coast","Edford. O","Condiments","Sirop d'érable",42116,40.893213867187498,160,2015,4,"Apr","YTD","NotPTM","Wed",6542.9142187500001]
["West Coast","Rooney. Y","Dairy Products","Camembert Pierrot",42117,225.98881347656251,191.25,2015,4,"Apr","YTD","NotPTM","Thu",43220.360577392581]
["North Coast","Atterson. P","Dairy Products","Geitost",42117,43.045488281250002,13.75,2015,4,"Apr","YTD","NotPTM","Thu",591.87546386718748]
["West Coast","Oddesy. Y","Meat/Poultry","Mishi Kobe Niku",42117,43.045488281250002,545.625,2015,4,"Apr","YTD","NotPTM","Thu",23486.694543457033]
["West Coast","Pursly. U","Confections","Pavlova",42117,134.51715087890625,98.125,2015,4,"Apr","YTD","NotPTM","Thu",13199.495429992676]
["West Coast","Stanly. N","Confections","Schoggi Schokolade",42117,322.84116210937503,246.875,2015,4,"Apr","YTD","NotPTM","Thu",79701.411895751968]
["South Coast","Franly. S","Seafood","Carnarvon Tigers",42118,67.796644042968737,351.25,2015,4,"Apr","YTD","NotPTM","Fri",23813.57122009277]
["East Coast","Peters. K","Grains/Cereals","Filo Mix",42118,16.142058105468749,39.375,2015,4,"Apr","YTD","NotPTM","Fri",635.59353790283194]
["West Coast","Numkin. M","Seafood","Jack's New England Clam Chowder",42118,215.22744140624999,53.75,2015,4,"Apr","YTD","NotPTM","Fri",11568.474975585938]
["West Coast","Toonly. S","Beverages","Outback Lager",42118,16.142058105468749,84.375,{"$f":"YEAR(E1348)","v":2015},{"$f":"MONTH(E1348)","v":4},{"$f":"TEXT(E1348,\"mmm\")","v":"Apr"},{"$f":"IF(I1348<MONTH(TODAY()),\"YTD\",\"Not YTD\")","v":"YTD"},{"$f":"IF(AND(E1348>=EarliestDate,E1348<=MostRecentDate),\"Past12Months\",\"NotPTM\")","v":"NotPTM"},{"$f":"TEXT(E1348,\"ddd\")","v":"Fri"},{"$f":"F1348*G1348","v":1361.9861526489258}]
["North Coast","Connely. K","Dairy Products","Raclette Courdavault",42118,10.7613720703125,309.375,2015,4,"Apr","YTD","NotPTM","Fri",3329.2994842529297]
["East Coast","Bonders. P","Grains/Cereals","Singaporean Hokkien Fried Mee",42118,53.806860351562499,78.75,2015,4,"Apr","YTD","NotPTM","Fri",4237.2902526855469]
["West Coast","Oddesy. Y","Beverages","Côte de Blaye",42119,40.893213867187498,1481.875,2015,4,"Apr","YTD","NotPTM","Sat",60598.631299438472]
["East Coast","Newson. L","Beverages","Guaraná Fantástica",42119,13.989783691406249,25,2015,4,"Apr","YTD","NotPTM","Sat",349.74459228515622]
["South Coast","Grooner. T","Condiments","Gula Malacca",42119,24.751155761718749,109.375,2015,4,"Apr","YTD","NotPTM","Sat",2707.1576614379883]
["North Coast","Dinnel. M","Dairy Products","Camembert Pierrot",42122,26.903430175781249,191.25,2015,4,"Apr","YTD","NotPTM","Tue",5145.2810211181641]
["East Coast","Perks. M","Grains/Cereals","Gnocchi di nonna Alice",42122,107.613720703125,213.75,2015,4,"Apr","YTD","NotPTM","Tue",23002.432800292969]
["East Coast","Lavin. T","Seafood","Ikura",42122,43.045488281250002,174.375,2015,4,"Apr","YTD","NotPTM","Tue",7506.0570190429689]
["North Coast","Edford. O","Beverages","Guaraná Fantástica",42123,21.522744140625001,25,2015,4,"Apr","YTD","NotPTM","Wed",538.068603515625]
["West Coast","Pursly. U","Seafood","Jack's New England Clam Chowder",42123,26.903430175781249,53.75,2015,4,"Apr","YTD","NotPTM","Wed",1446.0593719482422]
["South Coast","Hannis. H","Meat/Poultry","Perth Pasties",42123,13.989783691406249,184.375,2015,4,"Apr","YTD","NotPTM","Wed",2579.3663681030271]
["South Coast","Ilknis. K","Confections","Scottish Longbreads",42123,16.142058105468749,70,2015,4,"Apr","YTD","NotPTM","Wed",1129.9440673828124]
["East Coast","Anderson. P","Beverages","Steeleye Stout",42123,8.6090976562500003,101.25,2015,4,"Apr","YTD","NotPTM","Wed",871.6711376953125]
["North Coast","Oxford. D","Seafood","Boston Crab Meat",42124,67.796644042968737,103.125,2015,4,"Apr","YTD","NotPTM","Thu",6991.5289169311509]
["South Coast","Kinsly. N","Beverages","Chai",42124,107.613720703125,101.25,2015,4,"Apr","YTD","NotPTM","Thu",10895.889221191406]
["South Coast","Jarison. P","Seafood","Nord-Ost Matjeshering",42124,53.806860351562499,145.625,2015,4,"Apr","YTD","NotPTM","Thu",7835.6240386962891]
["East Coast","Johnson. A","Condiments","Northwoods Cranberry Sauce",42124,64.568232421874995,225,2015,4,"Apr","YTD","NotPTM","Thu",14527.852294921873]
["West Coast","Rooney. Y","Meat/Poultry","Alice Mutton",42125,73.93292056274413,175.5,2015,5,"May","YTD","NotPTM","Fri",12975.227558761595]
["South Coast","Moodley. L","Seafood","Gravad lax",42125,52.80922897338867,117,2015,5,"May","YTD","NotPTM","Fri",6178.6797898864743]
["East Coast","Peters. K","Seafood","Ikura",42125,5.8676921081542979,139.5,2015,5,"May","YTD","NotPTM","Fri",818.54304908752454]
["West Coast","Stanly. N","Beverages","Ipoh Coffee",42125,176.03076324462896,207,2015,5,"May","YTD","NotPTM","Fri",36438.367991638195]
["North Coast","Altercon. C","Seafood","Jack's New England Clam Chowder",42125,17.603076324462894,43,2015,5,"May","YTD","NotPTM","Fri",756.93228195190443]
["East Coast","Bonders. P","Seafood","Nord-Ost Matjeshering",42125,29.338460540771486,116.5,2015,5,"May","YTD","NotPTM","Fri",3417.930652999878]
["East Coast","Newson. L","Confections","Sir Rodney's Marmalade",42125,44.594460021972658,364.5,2015,5,"May","YTD","NotPTM","Fri",16254.680678009034]
["South Coast","Lumford. T","Meat/Poultry","Tourtière",42125,44.594460021972658,33.5,2015,5,"May","YTD","NotPTM","Fri",1493.9144107360839]
["North Coast","Atterson. P","Seafood","Boston Crab Meat",42126,44.594460021972658,82.5,2015,5,"May","YTD","NotPTM","Sat",3679.0429518127444]
["North Coast","Connely. K","Seafood","Inlagd Sill",42126,88.015381622314479,85.5,2015,5,"May","YTD","NotPTM","Sat",7525.3151287078881]
["West Coast","Toonly. S","Beverages","Chai",42129,23.470768432617191,81,2015,5,"May","YTD","NotPTM","Tue",1901.1322430419925]
["East Coast","Perks. M","Condiments","Chef Anton's Cajun Seasoning",42129,146.69230270385742,99,2015,5,"May","YTD","NotPTM","Tue",14522.537967681885]
["West Coast","Numkin. M","Grains/Cereals","Gnocchi di nonna Alice",42129,88.015381622314479,171,2015,5,"May","YTD","NotPTM","Tue",15050.630257415776]
["East Coast","Lavin. T","Seafood","Inlagd Sill",42129,88.015381622314479,85.5,2015,5,"May","YTD","NotPTM","Tue",7525.3151287078881]
["South Coast","Franly. S","Seafood","Konbu",42129,29.338460540771486,27,2015,5,"May","YTD","NotPTM","Tue",792.13843460083012]
["East Coast","Anderson. P","Dairy Products","Geitost",42130,23.470768432617191,11,2015,5,"May","YTD","NotPTM","Wed",258.17845275878909]
["North Coast","Dinnel. M","Dairy Products","Mozzarella di Giovanni",42130,26.991383697509765,156.5,2015,5,"May","YTD","NotPTM","Wed",4224.1515486602784]
["South Coast","Grooner. T","Dairy Products","Queso Cabrales",42130,9.3883073730468762,94.5,2015,5,"May","YTD","NotPTM","Wed",887.19504675292978]
["North Coast","Edford. O","Dairy Products","Gudbrandsdalsost",42131,29.338460540771486,162,2015,5,"May","YTD","NotPTM","Thu",4752.8306076049803]
["North Coast","Oxford. D","Meat/Poultry","Pâté chinois",42131,41.073844757080089,108,2015,5,"May","YTD","NotPTM","Thu",4435.9752337646496]
["North Coast","Altercon. C","Confections","Scottish Longbreads",42131,58.676921081542972,56,2015,5,"May","YTD","NotPTM","Thu",3285.9075805664065]
["North Coast","Atterson. P","Meat/Poultry","Alice Mutton",42132,117.35384216308594,175.5,2015,5,"May","YTD","NotPTM","Fri",20595.599299621583]
["East Coast","Johnson. A","Beverages","Ipoh Coffee",42132,73.93292056274413,207,2015,5,"May","YTD","NotPTM","Fri",15304.114556488035]
["South Coast","Ilknis. K","Beverages","Lakkalikööri",42132,146.69230270385742,81,2015,5,"May","YTD","NotPTM","Fri",11882.076519012451]
["South Coast","Hannis. H","Dairy Products","Raclette Courdavault",42132,5.8676921081542979,247.5,2015,5,"May","YTD","NotPTM","Fri",1452.2537967681887]
["West Coast","Oddesy. Y","Condiments","Sirop d'érable",42132,58.676921081542972,128,2015,5,"May","YTD","NotPTM","Fri",7510.6458984375004]
["South Coast","Jarison. P","Condiments","Louisiana Hot Spiced Okra",42133,70.412305297851574,76.5,2015,5,"May","YTD","NotPTM","Sat",5386.5413552856453]
["West Coast","Pursly. U","Seafood","Nord-Ost Matjeshering",42133,44.594460021972658,116.5,2015,5,"May","YTD","NotPTM","Sat",5195.2545925598142]
["South Coast","Kinsly. N","Seafood","Boston Crab Meat",42136,29.338460540771486,82.5,2015,5,"May","YTD","NotPTM","Tue",2420.4229946136475]
["North Coast","Dinnel. M","Condiments","Chef Anton's Cajun Seasoning",42136,146.69230270385742,99,2015,5,"May","YTD","NotPTM","Tue",14522.537967681885]
["North Coast","Connely. K","Dairy Products","Mozzarella di Giovanni",42136,70.412305297851574,156.5,2015,5,"May","YTD","NotPTM","Tue",11019.525779113772]
["East Coast","Peters. K","Seafood","Nord-Ost Matjeshering",42136,29.338460540771486,116.5,2015,5,"May","YTD","NotPTM","Tue",3417.930652999878]
["West Coast","Stanly. N","Seafood","Röd Kaviar",42136,70.412305297851574,67.5,2015,5,"May","YTD","NotPTM","Tue",4752.8306076049812]
["West Coast","Rooney. Y","Meat/Poultry","Tourtière",42136,29.338460540771486,33.5,2015,5,"May","YTD","NotPTM","Tue",982.83842811584475]
["North Coast","Oxford. D","Seafood","Boston Crab Meat",42137,29.338460540771486,82.5,2015,5,"May","YTD","NotPTM","Wed",2420.4229946136475]
["West Coast","Toonly. S","Dairy Products","Queso Cabrales",42137,146.69230270385742,94.5,2015,5,"May","YTD","NotPTM","Wed",13862.422605514526]
["East Coast","Bonders. P","Dairy Products","Raclette Courdavault",42137,44.594460021972658,247.5,2015,5,"May","YTD","NotPTM","Wed",11037.128855438234]
["North Coast","Edford. O","Grains/Cereals","Ravioli Angelo",42137,15.255999481201172,87.5,2015,5,"May","YTD","NotPTM","Wed",1334.8999546051025]
["North Coast","Altercon. C","Dairy Products","Camembert Pierrot",42138,103.27138110351562,153,2015,5,"May","YTD","NotPTM","Thu",15800.52130883789]
["East Coast","Newson. L","Seafood","Escargots de Bourgogne",42138,58.676921081542972,59.5,2015,5,"May","YTD","NotPTM","Thu",3491.2768043518067]
["South Coast","Moodley. L","Dairy Products","Geitost",42138,88.015381622314479,11,2015,5,"May","YTD","NotPTM","Thu",968.16919784545928]
["East Coast","Perks. M","Dairy Products","Gorgonzola Telino",42138,146.69230270385742,56,2015,5,"May","YTD","NotPTM","Thu",8214.7689514160156]
["West Coast","Numkin. M","Produce","Manjimup Dried Apples",42138,17.603076324462894,238.5,2015,5,"May","YTD","NotPTM","Thu",4198.3337033844]
["East Coast","Lavin. T","Dairy Products","Mozzarella di Giovanni",42138,62.197536346435548,156.5,2015,5,"May","YTD","NotPTM","Thu",9733.9144382171635]
["South Coast","Lumford. T","Dairy Products","Queso Manchego La Pastora",42138,44.594460021972658,171,2015,5,"May","YTD","NotPTM","Thu",7625.6526637573243]
["West Coast","Oddesy. Y","Seafood","Röd Kaviar",42138,26.991383697509765,67.5,2015,5,"May","YTD","NotPTM","Thu",1821.9183995819092]
["East Coast","Anderson. P","Dairy Products","Mozzarella di Giovanni",42139,3.5206152648925775,156.5,{"$f":"YEAR(E1412)","v":2015},{"$f":"MONTH(E1412)","v":5},{"$f":"TEXT(E1412,\"mmm\")","v":"May"},{"$f":"IF(I1412<MONTH(TODAY()),\"YTD\",\"Not YTD\")","v":"YTD"},{"$f":"IF(AND(E1412>=EarliestDate,E1412<=MostRecentDate),\"Past12Months\",\"NotPTM\")","v":"NotPTM"},{"$f":"TEXT(E1412,\"ddd\")","v":"Fri"},{"$f":"F1412*G1412","v":550.97628895568835}]
["West Coast","Pursly. U","Beverages","Outback Lager",42139,21.123691589355474,67.5,2015,5,"May","YTD","NotPTM","Fri",1425.8491822814944]
["West Coast","Rooney. Y","Dairy Products","Geitost",42140,44.594460021972658,11,2015,5,"May","YTD","NotPTM","Sat",490.53906024169925]
["South Coast","Franly. S","Seafood","Konbu",42140,23.470768432617191,27,2015,5,"May","YTD","NotPTM","Sat",633.71074768066421]
["East Coast","Johnson. A","Confections","Maxilaku",42140,17.603076324462894,90,2015,5,"May","YTD","NotPTM","Sat",1584.2768692016605]
["North Coast","Atterson. P","Confections","Sir Rodney's Scones",42140,44.594460021972658,45,2015,5,"May","YTD","NotPTM","Sat",2006.7507009887697]
["East Coast","Newson. L","Condiments","Aniseed Syrup",42143,176.03076324462896,45,2015,5,"May","YTD","NotPTM","Tue",7921.3843460083035]
["South Coast","Grooner. T","Beverages","Côte de Blaye",42143,99.750765838623067,1185.5,2015,5,"May","YTD","NotPTM","Tue",118254.53290168765]
["East Coast","Peters. K","Dairy Products","Fløtemysost",42143,26.991383697509765,96.5,2015,5,"May","YTD","NotPTM","Tue",2604.6685268096921]
["North Coast","Connely. K","Beverages","Guaraná Fantástica",42143,103.27138110351562,20,2015,5,"May","YTD","NotPTM","Tue",2065.4276220703123]
["West Coast","Toonly. S","Confections","Gumbär Gummibärchen",42143,117.35384216308594,140.5,2015,5,"May","YTD","NotPTM","Tue",16488.214823913575]
["East Coast","Bonders. P","Condiments","Louisiana Fiery Hot Pepper Sauce",42143,105.61845794677734,94.5,2015,5,"May","YTD","NotPTM","Tue",9980.944275970458]
["West Coast","Stanly. N","Confections","Scottish Longbreads",42143,103.27138110351562,56,2015,5,"May","YTD","NotPTM","Tue",5783.1973417968748]
["East Coast","Lavin. T","Dairy Products","Queso Cabrales",42144,44.594460021972658,94.5,2015,5,"May","YTD","NotPTM","Wed",4214.1764720764158]
["East Coast","Perks. M","Meat/Poultry","Tourtière",42144,70.412305297851574,33.5,2015,5,"May","YTD","NotPTM","Wed",2358.8122274780276]
["East Coast","Anderson. P","Beverages","Laughing Lumberjack Lager",42145,21.123691589355474,63,2015,5,"May","YTD","NotPTM","Thu",1330.7925701293948]
["North Coast","Dinnel. M","Dairy Products","Queso Manchego La Pastora",42145,88.015381622314479,171,2015,5,"May","YTD","NotPTM","Thu",15050.630257415776]
["South Coast","Hannis. H","Produce","Rössle Sauerkraut",42145,21.123691589355474,205,2015,5,"May","YTD","NotPTM","Thu",4330.3567758178724]
["South Coast","Ilknis. K","Grains/Cereals","Tunnbröd",42145,205.36922378540041,40.5,2015,5,"May","YTD","NotPTM","Thu",8317.4535633087162]
["West Coast","Numkin. M","Dairy Products","Queso Cabrales",42146,29.338460540771486,94.5,2015,5,"May","YTD","NotPTM","Fri",2772.4845211029055]
["South Coast","Kinsly. N","Seafood","Inlagd Sill",42147,176.03076324462896,85.5,2015,5,"May","YTD","NotPTM","Sat",15050.630257415776]
["South Coast","Jarison. P","Dairy Products","Mascarpone Fabioli",42147,70.412305297851574,144,2015,5,"May","YTD","NotPTM","Sat",10139.371962890627]
["West Coast","Oddesy. Y","Beverages","Steeleye Stout",42147,88.015381622314479,81,2015,5,"May","YTD","NotPTM","Sat",7129.2459114074727]
["East Coast","Peters. K","Confections","Tarte au sucre",42147,117.35384216308594,221.5,2015,5,"May","YTD","NotPTM","Sat",25993.876039123537]
["East Coast","Johnson. A","Produce","Uncle Bob's Organic Dried Pears",42147,29.338460540771486,135,2015,5,"May","YTD","NotPTM","Sat",3960.6921730041504]
["West Coast","Pursly. U","Seafood","Jack's New England Clam Chowder",42150,41.073844757080089,43,2015,5,"May","YTD","NotPTM","Tue",1766.1753245544437]
["South Coast","Lumford. T","Beverages","Sasquatch Ale",42150,29.338460540771486,63,2015,5,"May","YTD","NotPTM","Tue",1848.3230140686037]
["East Coast","Bonders. P","Dairy Products","Gorgonzola Telino",42151,161.94830218505865,56,2015,5,"May","YTD","NotPTM","Wed",9069.1049223632835]
["West Coast","Rooney. Y","Produce","Manjimup Dried Apples",42151,140.82461059570315,238.5,2015,5,"May","YTD","NotPTM","Wed",33586.6696270752]
["South Coast","Moodley. L","Seafood","Røgede sild",42151,293.38460540771484,42.5,2015,5,"May","YTD","NotPTM","Wed",12468.845729827881]
["North Coast","Edford. O","Meat/Poultry","Alice Mutton",42152,23.470768432617191,175.5,2015,5,"May","YTD","NotPTM","Thu",4119.1198599243171]
["South Coast","Hannis. H","Condiments","Gula Malacca",42152,117.35384216308594,87.5,2015,5,"May","YTD","NotPTM","Thu",10268.46118927002]
["North Coast","Altercon. C","Confections","Pavlova",42152,117.35384216308594,78.5,2015,5,"May","YTD","NotPTM","Thu",9212.2766098022457]
["South Coast","Franly. S","Confections","Sir Rodney's Scones",42152,17.603076324462894,45,2015,5,"May","YTD","NotPTM","Thu",792.13843460083024]
["North Coast","Oxford. D","Condiments","Sirop d'érable",42152,29.338460540771486,128,2015,5,"May","YTD","NotPTM","Thu",3755.3229492187502]
["South Coast","Grooner. T","Beverages","Steeleye Stout",42152,58.676921081542972,81,2015,5,"May","YTD","NotPTM","Thu",4752.8306076049803]
["West Coast","Stanly. N","Confections","Teatime Chocolate Biscuits",42152,29.338460540771486,41,2015,5,"May","YTD","NotPTM","Thu",1202.876882171631]
["North Coast","Atterson. P","Dairy Products","Gudbrandsdalsost",42153,52.80922897338867,162,2015,5,"May","YTD","NotPTM","Fri",8555.095093688964]
["East Coast","Newson. L","Beverages","Rhönbräu Klosterbier",42153,88.015381622314479,34.5,2015,5,"May","YTD","NotPTM","Fri",3036.5306659698495]
["South Coast","Jarison. P","Dairy Products","Gorgonzola Telino",42154,88.015381622314479,56,2015,5,"May","YTD","NotPTM","Sat",4928.8613708496105]
["North Coast","Edford. O","Grains/Cereals","Gustaf's Knäckebröd",42154,70.412305297851574,94.5,2015,5,"May","YTD","NotPTM","Sat",6653.9628506469735]
["East Coast","Lavin. T","Condiments","Original Frankfurter grüne Soße",42154,29.338460540771486,58.5,2015,5,"May","YTD","NotPTM","Sat",1716.299941635132]
["North Coast","Oxford. D","Confections","Pavlova",42154,129.08922637939455,78.5,2015,5,"May","YTD","NotPTM","Sat",10133.504270782472]
["South Coast","Ilknis. K","Dairy Products","Queso Cabrales",42154,44.594460021972658,94.5,2015,5,"May","YTD","NotPTM","Sat",4214.1764720764158]
["North Coast","Connely. K","Beverages","Steeleye Stout",42154,17.603076324462894,81,2015,5,"May","YTD","NotPTM","Sat",1425.8491822814944]
["North Coast","Dinnel. M","Confections","Tarte au sucre",42154,58.676921081542972,221.5,2015,5,"May","YTD","NotPTM","Sat",12996.938019561769]
["West Coast","Toonly. S","Grains/Cereals","Tunnbröd",42154,58.676921081542972,40.5,2015,5,"May","YTD","NotPTM","Sat",2376.4153038024901]
["West Coast","Oddesy. Y","Grains/Cereals","Gnocchi di nonna Alice",42157,214.53011169433594,171,2015,6,"Jun","YTD","NotPTM","Tue",36684.649099731447]
["West Coast","Numkin. M","Beverages","Guaraná Fantástica",42157,96.538550262451167,20,2015,6,"Jun","YTD","NotPTM","Tue",1930.7710052490233]
["East Coast","Perks. M","Produce","Manjimup Dried Apples",42157,107.26505584716797,238.5,2015,6,"Jun","YTD","NotPTM","Tue",25582.715819549561]
["East Coast","Anderson. P","Confections","Teatime Chocolate Biscuits",42157,188.78649829101559,41,2015,6,"Jun","YTD","NotPTM","Tue",7740.2464299316389]
["North Coast","Altercon. C","Produce","Tofu",42157,160.89758377075194,104.5,2015,6,"Jun","YTD","NotPTM","Tue",16813.797504043578]
["West Coast","Pursly. U","Dairy Products","Mozzarella di Giovanni",42158,128.71806701660157,156.5,2015,6,"Jun","YTD","NotPTM","Wed",20144.377488098144]
["South Coast","Kinsly. N","Beverages","Rhönbräu Klosterbier",42158,107.26505584716797,34.5,2015,6,"Jun","YTD","NotPTM","Wed",3700.644426727295]
["West Coast","Rooney. Y","Grains/Cereals","Wimmers gute Semmelknödel",42158,160.89758377075194,149.5,2015,6,"Jun","YTD","NotPTM","Wed",24054.188773727416]
["East Coast","Peters. K","Grains/Cereals","Filo Mix",42159,160.89758377075194,31.5,2015,6,"Jun","YTD","NotPTM","Thu",5068.2738887786863]
["North Coast","Connely. K","Produce","Manjimup Dried Apples",42159,107.26505584716797,238.5,2015,6,"Jun","YTD","NotPTM","Thu",25582.715819549561]
["East Coast","Johnson. A","Meat/Poultry","Perth Pasties",42159,96.538550262451167,147.5,2015,6,"Jun","YTD","NotPTM","Thu",14239.436163711547]
["North Coast","Atterson. P","Seafood","Röd Kaviar",42159,17.162408935546875,67.5,2015,6,"Jun","YTD","NotPTM","Thu",1158.462603149414]
["South Coast","Lumford. T","Confections","Zaanse koeken",42159,135.15397036743164,42.5,2015,6,"Jun","YTD","NotPTM","Thu",5744.0437406158444]
["East Coast","Bonders. P","Seafood","Jack's New England Clam Chowder",42160,64.359033508300783,43,2015,6,"Jun","YTD","NotPTM","Fri",2767.4384408569335]
["South Coast","Moodley. L","Meat/Poultry","Pâté chinois",42160,96.538550262451167,108,2015,6,"Jun","YTD","NotPTM","Fri",10426.163428344726]
["South Coast","Franly. S","Condiments","Gula Malacca",42161,53.632527923583986,87.5,2015,6,"Jun","YTD","NotPTM","Sat",4692.8461933135986]
["South Coast","Grooner. T","Produce","Manjimup Dried Apples",42161,268.16263961791992,238.5,2015,6,"Jun","YTD","NotPTM","Sat",63956.789548873901]
["West Coast","Stanly. N","Seafood","Nord-Ost Matjeshering",42161,107.26505584716797,116.5,{"$f":"YEAR(E1476)","v":2015},{"$f":"MONTH(E1476)","v":6},{"$f":"TEXT(E1476,\"mmm\")","v":"Jun"},{"$f":"IF(I1476<MONTH(TODAY()),\"YTD\",\"Not YTD\")","v":"YTD"},{"$f":"IF(AND(E1476>=EarliestDate,E1476<=MostRecentDate),\"Past12Months\",\"NotPTM\")","v":"NotPTM"},{"$f":"TEXT(E1476,\"ddd\")","v":"Sat"},{"$f":"F1476*G1476","v":12496.379006195069}]
["North Coast","Dinnel. M","Confections","Tarte au sucre",42161,81.521442443847647,221.5,2015,6,"Jun","YTD","NotPTM","Sat",18056.999501312253]
["East Coast","Newson. L","Dairy Products","Geitost",42164,107.26505584716797,11,2015,6,"Jun","YTD","NotPTM","Tue",1179.9156143188477]
["North Coast","Edford. O","Confections","Tarte au sucre",42164,53.632527923583986,221.5,2015,6,"Jun","YTD","NotPTM","Tue",11879.604935073852]
["South Coast","Hannis. H","Meat/Poultry","Alice Mutton",42165,85.812044677734363,175.5,2015,6,"Jun","YTD","NotPTM","Wed",15060.01384094238]
["North Coast","Altercon. C","Grains/Cereals","Filo Mix",42165,375.42769546508788,31.5,2015,6,"Jun","YTD","NotPTM","Wed",11825.972407150268]
["West Coast","Toonly. S","Dairy Products","Gorgonzola Telino",42165,32.179516754150391,56,2015,6,"Jun","YTD","NotPTM","Wed",1802.0529382324219]
["West Coast","Numkin. M","Seafood","Inlagd Sill",42165,135.15397036743164,85.5,2015,6,"Jun","YTD","NotPTM","Wed",11555.664466415405]
["North Coast","Oxford. D","Meat/Poultry","Pâté chinois",42165,135.15397036743164,108,2015,6,"Jun","YTD","NotPTM","Wed",14596.628799682618]
["East Coast","Lavin. T","Beverages","Guaraná Fantástica",42166,135.15397036743164,20,2015,6,"Jun","YTD","NotPTM","Thu",2703.0794073486327]
["North Coast","Atterson. P","Grains/Cereals","Wimmers gute Semmelknödel",42166,96.538550262451167,149.5,2015,6,"Jun","YTD","NotPTM","Thu",14432.51326423645]
["West Coast","Rooney. Y","Seafood","Carnarvon Tigers",42167,96.538550262451167,281,2015,6,"Jun","YTD","NotPTM","Fri",27127.332623748778]
["North Coast","Connely. K","Dairy Products","Gorgonzola Telino",42167,321.79516754150387,56,2015,6,"Jun","YTD","NotPTM","Fri",18020.529382324217]
["West Coast","Pursly. U","Beverages","Lakkalikööri",42167,53.632527923583986,81,2015,6,"Jun","YTD","NotPTM","Fri",4344.2347618103031]
["West Coast","Oddesy. Y","Produce","Manjimup Dried Apples",42167,17.162408935546875,238.5,2015,6,"Jun","YTD","NotPTM","Fri",4093.2345311279296]
["South Coast","Ilknis. K","Dairy Products","Queso Cabrales",42167,188.78649829101559,94.5,2015,6,"Jun","YTD","NotPTM","Fri",17840.324088500973]
["East Coast","Perks. M","Dairy Products","Raclette Courdavault",42167,214.53011169433594,247.5,2015,6,"Jun","YTD","NotPTM","Fri",53096.202644348145]
["West Coast","Stanly. N","Seafood","Ikura",42168,27.888914520263665,139.5,2015,6,"Jun","YTD","NotPTM","Sat",3890.5035755767813]
["North Coast","Dinnel. M","Dairy Products","Gorgonzola Telino",42171,188.78649829101559,56,2015,6,"Jun","YTD","NotPTM","Tue",10572.043904296874]
["South Coast","Jarison. P","Beverages","Lakkalikööri",42171,160.89758377075194,81,2015,6,"Jun","YTD","NotPTM","Tue",13032.704285430907]
["West Coast","Oddesy. Y","Grains/Cereals","Gnocchi di nonna Alice",42172,321.79516754150387,171,2015,6,"Jun","YTD","NotPTM","Wed",55026.973649597159]
["West Coast","Toonly. S","Dairy Products","Queso Cabrales",42172,81.521442443847647,94.5,2015,6,"Jun","YTD","NotPTM","Wed",7703.7763109436028]
["West Coast","Numkin. M","Grains/Cereals","Singaporean Hokkien Fried Mee",42172,150.17107818603517,63,2015,6,"Jun","YTD","NotPTM","Wed",9460.7779257202164]
["South Coast","Kinsly. N","Produce","Tofu",42172,60.06843127441406,104.5,2015,6,"Jun","YTD","NotPTM","Wed",6277.1510681762693]
["North Coast","Edford. O","Seafood","Boston Crab Meat",42173,268.16263961791992,82.5,2015,6,"Jun","YTD","NotPTM","Thu",22123.417768478394]
["East Coast","Anderson. P","Dairy Products","Mascarpone Fabioli",42173,53.632527923583986,144,2015,6,"Jun","YTD","NotPTM","Thu",7723.0840209960943]
["South Coast","Lumford. T","Confections","Pavlova",42173,64.359033508300783,78.5,2015,6,"Jun","YTD","NotPTM","Thu",5052.1841304016116]
["East Coast","Johnson. A","Beverages","Rhönbräu Klosterbier",42173,81.521442443847647,34.5,2015,6,"Jun","YTD","NotPTM","Thu",2812.4897643127438]
["East Coast","Newson. L","Meat/Poultry","Alice Mutton",42174,96.538550262451167,175.5,2015,6,"Jun","YTD","NotPTM","Fri",16942.515571060179]
["North Coast","Oxford. D","Seafood","Boston Crab Meat",42174,10.726505584716795,82.5,2015,6,"Jun","YTD","NotPTM","Fri",884.93671073913561]
["East Coast","Bonders. P","Dairy Products","Geitost",42174,75.085539093017587,11,2015,6,"Jun","YTD","NotPTM","Fri",825.94093002319346]
["South Coast","Franly. S","Meat/Poultry","Perth Pasties",42174,135.15397036743164,147.5,2015,6,"Jun","YTD","NotPTM","Fri",19935.210629196168]
["South Coast","Grooner. T","Beverages","Sasquatch Ale",42174,214.53011169433594,63,2015,6,"Jun","YTD","NotPTM","Fri",13515.397036743165]
["South Coast","Moodley. L","Confections","Tarte au sucre",42174,53.632527923583986,221.5,2015,6,"Jun","YTD","NotPTM","Fri",11879.604935073852]
["East Coast","Peters. K","Grains/Cereals","Wimmers gute Semmelknödel",42174,32.179516754150391,149.5,2015,6,"Jun","YTD","NotPTM","Fri",4810.8377547454838]
["North Coast","Altercon. C","Beverages","Lakkalikööri",42175,53.632527923583986,81,2015,6,"Jun","YTD","NotPTM","Sat",4344.2347618103031]
["North Coast","Connely. K","Dairy Products","Mozzarella di Giovanni",42175,160.89758377075194,156.5,2015,6,"Jun","YTD","NotPTM","Sat",25180.471860122678]
["North Coast","Atterson. P","Dairy Products","Raclette Courdavault",42175,64.359033508300783,247.5,2015,6,"Jun","YTD","NotPTM","Sat",15928.860793304444]
["South Coast","Hannis. H","Condiments","Vegie-spread",42175,32.179516754150391,197.5,2015,6,"Jun","YTD","NotPTM","Sat",6355.4545589447025]
["West Coast","Pursly. U","Beverages","Chai",42178,53.632527923583986,81,2015,6,"Jun","YTD","NotPTM","Tue",4344.2347618103031]
["East Coast","Lavin. T","Beverages","Chartreuse verte",42178,53.632527923583986,81,2015,6,"Jun","YTD","NotPTM","Tue",4344.2347618103031]
["North Coast","Dinnel. M","Dairy Products","Gorgonzola Telino",42178,107.26505584716797,56,2015,6,"Jun","YTD","NotPTM","Tue",6006.8431274414061]
["South Coast","Kinsly. N","Condiments","Gula Malacca",42178,113.70095919799803,87.5,2015,6,"Jun","YTD","NotPTM","Tue",9948.8339298248284]
["South Coast","Ilknis. K","Condiments","Original Frankfurter grüne Soße",42178,96.538550262451167,58.5,2015,6,"Jun","YTD","NotPTM","Tue",5647.5051903533931]
["South Coast","Jarison. P","Beverages","Rhönbräu Klosterbier",42178,107.26505584716797,34.5,2015,6,"Jun","YTD","NotPTM","Tue",3700.644426727295]
["North Coast","Edford. O","Grains/Cereals","Ravioli Angelo",42179,32.179516754150391,87.5,2015,6,"Jun","YTD","NotPTM","Wed",2815.7077159881592]
["West Coast","Rooney. Y","Beverages","Steeleye Stout",42179,107.26505584716797,81,2015,6,"Jun","YTD","NotPTM","Wed",8688.4695236206062]
["South Coast","Lumford. T","Condiments","Genen Shouyu",42180,53.632527923583986,69.5,2015,6,"Jun","YTD","NotPTM","Thu",3727.4606906890872]
["North Coast","Oxford. D","Beverages","Rhönbräu Klosterbier",42180,113.70095919799803,34.5,2015,6,"Jun","YTD","NotPTM","Thu",3922.6830923309321]
["South Coast","Moodley. L","Seafood","Jack's New England Clam Chowder",42181,49.341925689697256,43,2015,6,"Jun","YTD","NotPTM","Fri",2121.7028046569822]
["West Coast","Stanly. N","Condiments","Louisiana Fiery Hot Pepper Sauce",42181,160.89758377075194,94.5,2015,6,"Jun","YTD","NotPTM","Fri",15204.821666336058]
["West Coast","Toonly. S","Beverages","Rhönbräu Klosterbier",42181,268.16263961791992,34.5,2015,6,"Jun","YTD","NotPTM","Fri",9251.6110668182373]
["South Coast","Franly. S","Produce","Tofu",42181,81.521442443847647,104.5,2015,6,"Jun","YTD","NotPTM","Fri",8518.9907353820799]
["South Coast","Grooner. T","Beverages","Lakkalikööri",42182,75.085539093017587,81,2015,6,"Jun","YTD","NotPTM","Sat",6081.9286665344243]
["West Coast","Numkin. M","Grains/Cereals","Ravioli Angelo",42182,21.453011169433591,87.5,2015,6,"Jun","YTD","NotPTM","Sat",1877.1384773254392]
["East Coast","Perks. M","Dairy Products","Camembert Pierrot",42185,128.71806701660157,153,2015,6,"Jun","YTD","NotPTM","Tue",19693.864253540039]
["East Coast","Anderson. P","Dairy Products","Gorgonzola Telino",42185,268.16263961791992,56,2015,6,"Jun","YTD","NotPTM","Tue",15017.107818603516]
["North Coast","Altercon. C","Dairy Products","Gudbrandsdalsost",42185,53.632527923583986,162,2015,6,"Jun","YTD","NotPTM","Tue",8688.4695236206062]
["West Coast","Oddesy. Y","Meat/Poultry","Thüringer Rostbratwurst",42185,53.632527923583986,557,2015,6,"Jun","YTD","NotPTM","Tue",29873.31805343628]
["North Coast","Atterson. P","Confections","Zaanse koeken",42186,54.706640624999999,42.5,2015,7,"Jul","YTD","NotPTM","Wed",2325.0322265625]
["East Coast","Johnson. A","Grains/Cereals","Filo Mix",42187,14.396484375,31.5,2015,7,"Jul","YTD","NotPTM","Thu",453.4892578125]
["West Coast","Pursly. U","Confections","Gumbär Gummibärchen",42187,21.5947265625,140.5,2015,7,"Jul","YTD","NotPTM","Thu",3034.05908203125]
["South Coast","Hannis. H","Condiments","Original Frankfurter grüne Soße",42187,71.982421875,58.5,2015,7,"Jul","YTD","NotPTM","Thu",4210.9716796875]
["East Coast","Peters. K","Beverages","Steeleye Stout",42187,71.982421875,81,2015,7,"Jul","YTD","NotPTM","Thu",5830.576171875]
["North Coast","Connely. K","Seafood","Carnarvon Tigers",42188,143.96484375,281,{"$f":"YEAR(E1540)","v":2015},{"$f":"MONTH(E1540)","v":7},{"$f":"TEXT(E1540,\"mmm\")","v":"Jul"},{"$f":"IF(I1540<MONTH(TODAY()),\"YTD\",\"Not YTD\")","v":"YTD"},{"$f":"IF(AND(E1540>=EarliestDate,E1540<=MostRecentDate),\"Past12Months\",\"NotPTM\")","v":"NotPTM"},{"$f":"TEXT(E1540,\"ddd\")","v":"Fri"},{"$f":"F1540*G1540","v":40454.12109375}]
["North Coast","Dinnel. M","Grains/Cereals","Singaporean Hokkien Fried Mee",42188,359.912109375,63,2015,7,"Jul","YTD","NotPTM","Fri",22674.462890625]
["South Coast","Ilknis. K","Beverages","Steeleye Stout",42189,14.396484375,81,2015,7,"Jul","YTD","NotPTM","Sat",1166.115234375]
["North Coast","Edford. O","Condiments","Aniseed Syrup",42192,50.387695312500007,45,2015,7,"Jul","YTD","NotPTM","Tue",2267.4462890625005]
["North Coast","Oxford. D","Beverages","Chai",42192,71.982421875,81,2015,7,"Jul","YTD","NotPTM","Tue",5830.576171875]
["East Coast","Newson. L","Condiments","Original Frankfurter grüne Soße",42192,215.94726562500003,58.5,2015,7,"Jul","YTD","NotPTM","Tue",12632.915039062502]
["South Coast","Jarison. P","Meat/Poultry","Tourtière",42192,179.9560546875,33.5,2015,7,"Jul","YTD","NotPTM","Tue",6028.52783203125]
["East Coast","Bonders. P","Produce","Uncle Bob's Organic Dried Pears",42192,35.9912109375,135,2015,7,"Jul","YTD","NotPTM","Tue",4858.8134765625]
["North Coast","Altercon. C","Condiments","Genen Shouyu",42193,90.697851562499991,69.5,2015,7,"Jul","YTD","NotPTM","Wed",6303.5006835937493]
["East Coast","Lavin. T","Confections","Gumbär Gummibärchen",42193,18.715429687499999,140.5,2015,7,"Jul","YTD","NotPTM","Wed",2629.5178710937498]
["East Coast","Perks. M","Seafood","Escargots de Bourgogne",42194,107.97363281250001,59.5,2015,7,"Jul","YTD","NotPTM","Thu",6424.4311523437509]
["South Coast","Kinsly. N","Grains/Cereals","Filo Mix",42194,86.37890625,31.5,2015,7,"Jul","YTD","NotPTM","Thu",2720.935546875]
["West Coast","Rooney. Y","Dairy Products","Gudbrandsdalsost",42194,71.982421875,162,2015,7,"Jul","YTD","NotPTM","Thu",11661.15234375]
["North Coast","Atterson. P","Beverages","Lakkalikööri",42194,14.396484375,81,2015,7,"Jul","YTD","NotPTM","Thu",1166.115234375]
["West Coast","Stanly. N","Confections","Sir Rodney's Marmalade",42194,76.301367187499991,364.5,2015,7,"Jul","YTD","NotPTM","Thu",27811.848339843746]
["North Coast","Connely. K","Dairy Products","Gudbrandsdalsost",42195,234.66269531250001,162,2015,7,"Jul","YTD","NotPTM","Fri",38015.356640625003]
["East Coast","Anderson. P","Condiments","Sirop d'érable",42195,431.89453125000006,128,2015,7,"Jul","YTD","NotPTM","Fri",55282.500000000007]
["South Coast","Lumford. T","Beverages","Steeleye Stout",42195,107.97363281250001,81,2015,7,"Jul","YTD","NotPTM","Fri",8745.8642578125018]
["South Coast","Moodley. L","Grains/Cereals","Gnocchi di nonna Alice",42196,18.715429687499999,171,2015,7,"Jul","YTD","NotPTM","Sat",3200.3384765624996]
["West Coast","Numkin. M","Beverages","Guaraná Fantástica",42196,126.68906249999999,20,2015,7,"Jul","YTD","NotPTM","Sat",2533.78125]
["West Coast","Toonly. S","Condiments","Louisiana Fiery Hot Pepper Sauce",42196,43.189453125,94.5,2015,7,"Jul","YTD","NotPTM","Sat",4081.4033203125]
["East Coast","Johnson. A","Grains/Cereals","Ravioli Angelo",42196,71.982421875,87.5,2015,7,"Jul","YTD","NotPTM","Sat",6298.4619140625]
["North Coast","Edford. O","Beverages","Rhönbräu Klosterbier",42196,107.97363281250001,34.5,2015,7,"Jul","YTD","NotPTM","Sat",3725.0903320312505]
["North Coast","Dinnel. M","Condiments","Vegie-spread",42196,86.37890625,197.5,2015,7,"Jul","YTD","NotPTM","Sat",17059.833984375]
["North Coast","Oxford. D","Dairy Products","Fløtemysost",42199,33.111914062499999,96.5,2015,7,"Jul","YTD","NotPTM","Tue",3195.2997070312499]
["North Coast","Altercon. C","Confections","Schoggi Schokolade",42199,179.9560546875,197.5,2015,7,"Jul","YTD","NotPTM","Tue",35541.32080078125]
["South Coast","Franly. S","Confections","Tarte au sucre",42200,35.9912109375,221.5,2015,7,"Jul","YTD","NotPTM","Wed",7972.05322265625]
["South Coast","Grooner. T","Seafood","Konbu",42201,215.94726562500003,27,2015,7,"Jul","YTD","NotPTM","Thu",5830.5761718750009]
["East Coast","Peters. K","Dairy Products","Raclette Courdavault",42201,126.68906249999999,247.5,2015,7,"Jul","YTD","NotPTM","Thu",31355.542968749996]
["West Coast","Pursly. U","Seafood","Röd Kaviar",42201,107.97363281250001,67.5,2015,7,"Jul","YTD","NotPTM","Thu",7288.2202148437509]
["West Coast","Oddesy. Y","Meat/Poultry","Tourtière",42201,14.396484375,33.5,2015,7,"Jul","YTD","NotPTM","Thu",482.2822265625]
["North Coast","Atterson. P","Condiments","Original Frankfurter grüne Soße",42202,18.715429687499999,58.5,2015,7,"Jul","YTD","NotPTM","Fri",1094.8526367187499]
["East Coast","Bonders. P","Confections","Chocolade",42203,21.5947265625,57,2015,7,"Jul","YTD","NotPTM","Sat",1230.8994140625]
["East Coast","Newson. L","Grains/Cereals","Gustaf's Knäckebröd",42203,172.7578125,94.5,2015,7,"Jul","YTD","NotPTM","Sat",16325.61328125]
["North Coast","Connely. K","Beverages","Lakkalikööri",42203,35.9912109375,81,2015,7,"Jul","YTD","NotPTM","Sat",2915.2880859375]
["West Coast","Rooney. Y","Confections","Maxilaku",42203,90.697851562499991,90,2015,7,"Jul","YTD","NotPTM","Sat",8162.8066406249991]
["West Coast","Toonly. S","Dairy Products","Camembert Pierrot",42206,251.9384765625,153,2015,7,"Jul","YTD","NotPTM","Tue",38546.5869140625]
["West Coast","Stanly. N","Dairy Products","Fløtemysost",42206,54.706640624999999,96.5,2015,7,"Jul","YTD","NotPTM","Tue",5279.1908203124995]
["East Coast","Lavin. T","Confections","Pavlova",42206,107.97363281250001,78.5,2015,7,"Jul","YTD","NotPTM","Tue",8475.9301757812518]
["South Coast","Hannis. H","Dairy Products","Raclette Courdavault",42206,71.982421875,247.5,2015,7,"Jul","YTD","NotPTM","Tue",17815.6494140625]
["West Coast","Rooney. Y","Meat/Poultry","Alice Mutton",42207,359.912109375,175.5,2015,7,"Jul","YTD","NotPTM","Wed",63164.5751953125]
["East Coast","Anderson. P","Seafood","Boston Crab Meat",42207,151.1630859375,82.5,2015,7,"Jul","YTD","NotPTM","Wed",12470.95458984375]
["North Coast","Dinnel. M","Condiments","Chef Anton's Cajun Seasoning",42207,71.982421875,99,2015,7,"Jul","YTD","NotPTM","Wed",7126.259765625]
["West Coast","Oddesy. Y","Dairy Products","Geitost",42207,50.387695312500007,11,2015,7,"Jul","YTD","NotPTM","Wed",554.26464843750011]
["East Coast","Perks. M","Dairy Products","Mozzarella di Giovanni",42207,43.189453125,156.5,2015,7,"Jul","YTD","NotPTM","Wed",6759.1494140625]
["West Coast","Pursly. U","Meat/Poultry","Pâté chinois",42207,71.982421875,108,2015,7,"Jul","YTD","NotPTM","Wed",7774.1015625]
["West Coast","Numkin. M","Confections","Tarte au sucre",42207,35.9912109375,221.5,2015,7,"Jul","YTD","NotPTM","Wed",7972.05322265625]
["South Coast","Ilknis. K","Produce","Uncle Bob's Organic Dried Pears",42207,162.68027343750001,135,2015,7,"Jul","YTD","NotPTM","Wed",21961.8369140625]
["East Coast","Johnson. A","Grains/Cereals","Gnocchi di nonna Alice",42208,100.77539062500001,171,2015,7,"Jul","YTD","NotPTM","Thu",17232.591796875004]
["East Coast","Peters. K","Beverages","Chai",42209,11.5171875,81,2015,7,"Jul","YTD","NotPTM","Fri",932.89218749999998]
["East Coast","Bonders. P","Seafood","Ikura",42209,35.9912109375,139.5,2015,7,"Jul","YTD","NotPTM","Fri",5020.77392578125]
["South Coast","Jarison. P","Confections","Sir Rodney's Scones",42209,21.5947265625,45,2015,7,"Jul","YTD","NotPTM","Fri",971.7626953125]
["East Coast","Newson. L","Dairy Products","Camembert Pierrot",42210,54.706640624999999,153,2015,7,"Jul","YTD","NotPTM","Sat",8370.1160156249989]
["North Coast","Edford. O","Beverages","Chai",42210,21.5947265625,81,2015,7,"Jul","YTD","NotPTM","Sat",1749.1728515625]
["South Coast","Kinsly. N","Beverages","Chang",42210,35.9912109375,85.5,2015,7,"Jul","YTD","NotPTM","Sat",3077.24853515625]
["East Coast","Lavin. T","Seafood","Inlagd Sill",42210,76.301367187499991,85.5,2015,7,"Jul","YTD","NotPTM","Sat",6523.7668945312489]
["West Coast","Stanly. N","Dairy Products","Camembert Pierrot",42213,143.96484375,153,2015,7,"Jul","YTD","NotPTM","Tue",22026.62109375]
["East Coast","Perks. M","Seafood","Ikura",42213,251.9384765625,139.5,2015,7,"Jul","YTD","NotPTM","Tue",35145.41748046875]
["South Coast","Lumford. T","Seafood","Inlagd Sill",42213,198.67148437500003,85.5,2015,7,"Jul","YTD","NotPTM","Tue",16986.411914062504]
["East Coast","Anderson. P","Beverages","Lakkalikööri",42213,287.9296875,81,2015,7,"Jul","YTD","NotPTM","Tue",23322.3046875]
["North Coast","Oxford. D","Confections","Maxilaku",42213,64.7841796875,90,2015,7,"Jul","YTD","NotPTM","Tue",5830.576171875]
["West Coast","Toonly. S","Beverages","Chartreuse verte",42214,18.715429687499999,81,2015,7,"Jul","YTD","NotPTM","Wed",1515.9498046874999]
["East Coast","Johnson. A","Seafood","Konbu",42214,28.79296875,27,2015,7,"Jul","YTD","NotPTM","Wed",777.41015625]
["East Coast","Peters. K","Dairy Products","Queso Cabrales",42214,50.387695312500007,94.5,2015,7,"Jul","YTD","NotPTM","Wed",4761.6372070312509]
["East Coast","Bonders. P","Beverages","Rhönbräu Klosterbier",42214,143.96484375,34.5,{"$f":"YEAR(E1604)","v":2015},{"$f":"MONTH(E1604)","v":7},{"$f":"TEXT(E1604,\"mmm\")","v":"Jul"},{"$f":"IF(I1604<MONTH(TODAY()),\"YTD\",\"Not YTD\")","v":"YTD"},{"$f":"IF(AND(E1604>=EarliestDate,E1604<=MostRecentDate),\"Past12Months\",\"NotPTM\")","v":"NotPTM"},{"$f":"TEXT(E1604,\"ddd\")","v":"Wed"},{"$f":"F1604*G1604","v":4966.787109375}]
["West Coast","Numkin. M","Confections","Sir Rodney's Scones",42214,28.79296875,45,2015,7,"Jul","YTD","NotPTM","Wed",1295.68359375]
["East Coast","Newson. L","Meat/Poultry","Pâté chinois",42215,18.715429687499999,108,2015,7,"Jul","YTD","NotPTM","Thu",2021.2664062499998]
["South Coast","Franly. S","Beverages","Côte de Blaye",42216,54.706640624999999,1185.5,2015,7,"Jul","YTD","NotPTM","Fri",64854.722460937497]
["West Coast","Oddesy. Y","Dairy Products","Fløtemysost",42216,54.706640624999999,96.5,2015,7,"Jul","YTD","NotPTM","Fri",5279.1908203124995]
["South Coast","Moodley. L","Grains/Cereals","Gnocchi di nonna Alice",42216,50.387695312500007,171,2015,7,"Jul","YTD","NotPTM","Fri",8616.2958984375018]
["North Coast","Altercon. C","Beverages","Outback Lager",42216,54.706640624999999,67.5,2015,7,"Jul","YTD","NotPTM","Fri",3692.6982421875]
["South Coast","Grooner. T","Dairy Products","Raclette Courdavault",42216,107.97363281250001,247.5,2015,7,"Jul","YTD","NotPTM","Fri",26723.474121093754]
["East Coast","Perks. M","Grains/Cereals","Gnocchi di nonna Alice",42217,71.982421875,171,2015,8,"Aug","YTD","NotPTM","Sat",12308.994140625]
["South Coast","Hannis. H","Condiments","Grandma's Boysenberry Spread",42217,251.9384765625,112.5,2015,8,"Aug","YTD","NotPTM","Sat",28343.07861328125]
["East Coast","Lavin. T","Confections","Scottish Longbreads",42217,54.706640624999999,56,2015,8,"Aug","YTD","NotPTM","Sat",3063.5718750000001]
["South Coast","Ilknis. K","Grains/Cereals","Gustaf's Knäckebröd",42220,143.96484375,94.5,2015,8,"Aug","YTD","NotPTM","Tue",13604.677734375]
["South Coast","Jarison. P","Confections","Sir Rodney's Scones",42220,151.1630859375,45,2015,8,"Aug","YTD","NotPTM","Tue",6802.3388671875]
["West Coast","Pursly. U","Grains/Cereals","Filo Mix",42221,18.715429687499999,31.5,2015,8,"Aug","YTD","NotPTM","Wed",589.53603515624991]
["South Coast","Lumford. T","Dairy Products","Fløtemysost",42221,54.706640624999999,96.5,2015,8,"Aug","YTD","NotPTM","Wed",5279.1908203124995]
["South Coast","Kinsly. N","Beverages","Guaraná Fantástica",42221,18.715429687499999,20,2015,8,"Aug","YTD","NotPTM","Wed",374.30859375]
["South Coast","Moodley. L","Beverages","Outback Lager",42221,71.982421875,67.5,2015,8,"Aug","YTD","NotPTM","Wed",4858.8134765625]
["North Coast","Atterson. P","Confections","Teatime Chocolate Biscuits",42221,18.715429687499999,41,2015,8,"Aug","YTD","NotPTM","Wed",767.33261718749998]
["North Coast","Connely. K","Grains/Cereals","Tunnbröd",42221,35.9912109375,40.5,2015,8,"Aug","YTD","NotPTM","Wed",1457.64404296875]
["North Coast","Dinnel. M","Beverages","Chang",42222,71.982421875,85.5,2015,8,"Aug","YTD","NotPTM","Thu",6154.4970703125]
["West Coast","Rooney. Y","Confections","Scottish Longbreads",42222,64.7841796875,56,2015,8,"Aug","YTD","NotPTM","Thu",3627.9140625]
["South Coast","Franly. S","Beverages","Guaraná Fantástica",42223,11.5171875,20,2015,8,"Aug","YTD","NotPTM","Fri",230.34375]
["West Coast","Toonly. S","Condiments","Gula Malacca",42223,35.9912109375,87.5,2015,8,"Aug","YTD","NotPTM","Fri",3149.23095703125]
["East Coast","Anderson. P","Produce","Rössle Sauerkraut",42223,35.9912109375,205,2015,8,"Aug","YTD","NotPTM","Fri",7378.1982421875]
["East Coast","Johnson. A","Confections","Sir Rodney's Scones",42223,90.697851562499991,45,2015,8,"Aug","YTD","NotPTM","Fri",4081.4033203124995]
["North Coast","Oxford. D","Beverages","Steeleye Stout",42223,107.97363281250001,81,2015,8,"Aug","YTD","NotPTM","Fri",8745.8642578125018]
["North Coast","Edford. O","Confections","Teatime Chocolate Biscuits",42223,54.706640624999999,41,2015,8,"Aug","YTD","NotPTM","Fri",2242.9722656250001]
["West Coast","Stanly. N","Meat/Poultry","Thüringer Rostbratwurst",42223,21.5947265625,557,2015,8,"Aug","YTD","NotPTM","Fri",12028.2626953125]
["South Coast","Grooner. T","Produce","Tofu",42223,76.301367187499991,104.5,2015,8,"Aug","YTD","NotPTM","Fri",7973.4928710937493]
["South Coast","Hannis. H","Dairy Products","Camembert Pierrot",42224,35.9912109375,153,2015,8,"Aug","YTD","NotPTM","Sat",5506.6552734375]
["East Coast","Peters. K","Grains/Cereals","Singaporean Hokkien Fried Mee",42224,18.715429687499999,63,2015,8,"Aug","YTD","NotPTM","Sat",1179.0720703124998]
["North Coast","Altercon. C","Produce","Tofu",42224,11.5171875,104.5,2015,8,"Aug","YTD","NotPTM","Sat",1203.54609375]
["West Coast","Oddesy. Y","Dairy Products","Camembert Pierrot",42227,71.982421875,153,2015,8,"Aug","YTD","NotPTM","Tue",11013.310546875]
["East Coast","Bonders. P","Dairy Products","Fløtemysost",42227,71.982421875,96.5,2015,8,"Aug","YTD","NotPTM","Tue",6946.3037109375]
["South Coast","Ilknis. K","Meat/Poultry","Perth Pasties",42227,43.189453125,147.5,2015,8,"Aug","YTD","NotPTM","Tue",6370.4443359375]
["South Coast","Jarison. P","Seafood","Röd Kaviar",42227,126.68906249999999,67.5,2015,8,"Aug","YTD","NotPTM","Tue",8551.51171875]
["West Coast","Numkin. M","Confections","Tarte au sucre",42227,54.706640624999999,221.5,2015,8,"Aug","YTD","NotPTM","Tue",12117.5208984375]
["South Coast","Lumford. T","Beverages","Chai",42228,90.697851562499991,81,2015,8,"Aug","YTD","NotPTM","Wed",7346.5259765624996]
["South Coast","Kinsly. N","Meat/Poultry","Thüringer Rostbratwurst",42228,71.982421875,557,2015,8,"Aug","YTD","NotPTM","Wed",40094.208984375]
["West Coast","Pursly. U","Grains/Cereals","Wimmers gute Semmelknödel",42228,33.111914062499999,149.5,2015,8,"Aug","YTD","NotPTM","Wed",4950.2311523437502]
["North Coast","Connely. K","Beverages","Lakkalikööri",42229,126.68906249999999,81,2015,8,"Aug","YTD","NotPTM","Thu",10261.8140625]
["North Coast","Atterson. P","Meat/Poultry","Pâté chinois",42229,43.189453125,108,2015,8,"Aug","YTD","NotPTM","Thu",4664.4609375]
["West Coast","Rooney. Y","Beverages","Chang",42230,107.97363281250001,85.5,2015,8,"Aug","YTD","NotPTM","Fri",9231.7456054687518]
["North Coast","Dinnel. M","Dairy Products","Geitost",42230,71.982421875,11,2015,8,"Aug","YTD","NotPTM","Fri",791.806640625]
["South Coast","Moodley. L","Beverages","Rhönbräu Klosterbier",42230,28.79296875,34.5,2015,8,"Aug","YTD","NotPTM","Fri",993.357421875]
["West Coast","Numkin. M","Seafood","Carnarvon Tigers",42231,179.9560546875,281,2015,8,"Aug","YTD","NotPTM","Sat",50567.6513671875]
["West Coast","Toonly. S","Confections","Gumbär Gummibärchen",42231,126.68906249999999,140.5,2015,8,"Aug","YTD","NotPTM","Sat",17799.813281249997]
["North Coast","Edford. O","Seafood","Konbu",42231,47.508398437500006,27,2015,8,"Aug","YTD","NotPTM","Sat",1282.7267578125002]
["East Coast","Newson. L","Produce","Manjimup Dried Apples",42231,54.706640624999999,238.5,2015,8,"Aug","YTD","NotPTM","Sat",13047.5337890625]
["South Coast","Franly. S","Dairy Products","Queso Manchego La Pastora",42231,129.568359375,171,2015,8,"Aug","YTD","NotPTM","Sat",22156.189453125]
["West Coast","Stanly. N","Beverages","Rhönbräu Klosterbier",42231,7.1982421875,34.5,2015,8,"Aug","YTD","NotPTM","Sat",248.33935546875]
["South Coast","Grooner. T","Confections","Tarte au sucre",42231,287.9296875,221.5,2015,8,"Aug","YTD","NotPTM","Sat",63776.42578125]
["East Coast","Lavin. T","Produce","Uncle Bob's Organic Dried Pears",42231,126.68906249999999,135,2015,8,"Aug","YTD","NotPTM","Sat",17103.0234375]
["North Coast","Oxford. D","Condiments","Chef Anton's Cajun Seasoning",42234,35.9912109375,99,2015,8,"Aug","YTD","NotPTM","Tue",3563.1298828125]
["South Coast","Hannis. H","Condiments","Chef Anton's Gumbo Mix",42234,54.706640624999999,96,2015,8,"Aug","YTD","NotPTM","Tue",5251.8374999999996]
["North Coast","Altercon. C","Grains/Cereals","Gustaf's Knäckebröd",42234,143.96484375,94.5,2015,8,"Aug","YTD","NotPTM","Tue",13604.677734375]
["North Coast","Atterson. P","Condiments","Chef Anton's Cajun Seasoning",42235,90.697851562499991,99,2015,8,"Aug","YTD","NotPTM","Wed",8979.0873046874985]
["East Coast","Perks. M","Seafood","Escargots de Bourgogne",42235,21.5947265625,59.5,2015,8,"Aug","YTD","NotPTM","Wed",1284.88623046875]
["North Coast","Connely. K","Grains/Cereals","Gnocchi di nonna Alice",42235,215.94726562500003,171,2015,8,"Aug","YTD","NotPTM","Wed",36926.982421875007]
["West Coast","Oddesy. Y","Dairy Products","Queso Cabrales",42235,35.9912109375,94.5,2015,8,"Aug","YTD","NotPTM","Wed",3401.16943359375]
["West Coast","Pursly. U","Confections","Valkoinen suklaa",42235,90.697851562499991,73,2015,8,"Aug","YTD","NotPTM","Wed",6620.9431640624998]
["North Coast","Dinnel. M","Seafood","Carnarvon Tigers",42236,28.79296875,281,2015,8,"Aug","YTD","NotPTM","Thu",8090.82421875]
["North Coast","Edford. O","Condiments","Louisiana Fiery Hot Pepper Sauce",42236,76.301367187499991,94.5,2015,8,"Aug","YTD","NotPTM","Thu",7210.4791992187493]
["West Coast","Stanly. N","Dairy Products","Mozzarella di Giovanni",42236,215.94726562500003,156.5,2015,8,"Aug","YTD","NotPTM","Thu",33795.747070312507]
["West Coast","Rooney. Y","Seafood","Røgede sild",42236,71.982421875,42.5,{"$f":"YEAR(E1668)","v":2015},{"$f":"MONTH(E1668)","v":8},{"$f":"TEXT(E1668,\"mmm\")","v":"Aug"},{"$f":"IF(I1668<MONTH(TODAY()),\"YTD\",\"Not YTD\")","v":"YTD"},{"$f":"IF(AND(E1668>=EarliestDate,E1668<=MostRecentDate),\"Past12Months\",\"NotPTM\")","v":"NotPTM"},{"$f":"TEXT(E1668,\"ddd\")","v":"Thu"},{"$f":"F1668*G1668","v":3059.2529296875}]
["East Coast","Anderson. P","Dairy Products","Gudbrandsdalsost",42237,71.982421875,162,2015,8,"Aug","YTD","NotPTM","Fri",11661.15234375]
["North Coast","Oxford. D","Beverages","Outback Lager",42237,54.706640624999999,67.5,2015,8,"Aug","YTD","NotPTM","Fri",3692.6982421875]
["East Coast","Bonders. P","Seafood","Boston Crab Meat",42238,215.94726562500003,82.5,2015,8,"Aug","YTD","NotPTM","Sat",17815.649414062504]
["East Coast","Peters. K","Beverages","Chang",42238,179.9560546875,85.5,2015,8,"Aug","YTD","NotPTM","Sat",15386.24267578125]
["East Coast","Johnson. A","Confections","Sir Rodney's Scones",42238,107.97363281250001,45,2015,8,"Aug","YTD","NotPTM","Sat",4858.8134765625009]
["South Coast","Ilknis. K","Condiments","Sirop d'érable",42238,71.982421875,128,2015,8,"Aug","YTD","NotPTM","Sat",9213.75]
["East Coast","Newson. L","Seafood","Carnarvon Tigers",42241,14.396484375,281,2015,8,"Aug","YTD","NotPTM","Tue",4045.412109375]
["West Coast","Numkin. M","Beverages","Chartreuse verte",42241,76.301367187499991,81,2015,8,"Aug","YTD","NotPTM","Tue",6180.4107421874996]
["North Coast","Altercon. C","Beverages","Ipoh Coffee",42241,71.982421875,207,2015,8,"Aug","YTD","NotPTM","Tue",14900.361328125]
["West Coast","Toonly. S","Produce","Rössle Sauerkraut",42241,54.706640624999999,205,2015,8,"Aug","YTD","NotPTM","Tue",11214.861328125]
["West Coast","Oddesy. Y","Seafood","Spegesild",42241,83.499609374999991,54,2015,8,"Aug","YTD","NotPTM","Tue",4508.9789062499995]
["West Coast","Pursly. U","Seafood","Carnarvon Tigers",42242,71.982421875,281,2015,8,"Aug","YTD","NotPTM","Wed",20227.060546875]
["East Coast","Lavin. T","Seafood","Inlagd Sill",42242,54.706640624999999,85.5,2015,8,"Aug","YTD","NotPTM","Wed",4677.4177734374998]
["South Coast","Jarison. P","Beverages","Chai",42243,54.706640624999999,81,2015,8,"Aug","YTD","NotPTM","Thu",4431.2378906249996]
["East Coast","Anderson. P","Beverages","Chartreuse verte",42243,71.982421875,81,2015,8,"Aug","YTD","NotPTM","Thu",5830.576171875]
["North Coast","Atterson. P","Dairy Products","Fløtemysost",42243,107.97363281250001,96.5,2015,8,"Aug","YTD","NotPTM","Thu",10419.455566406252]
["East Coast","Perks. M","Seafood","Ikura",42243,64.7841796875,139.5,2015,8,"Aug","YTD","NotPTM","Thu",9037.39306640625]
["South Coast","Lumford. T","Condiments","Original Frankfurter grüne Soße",42243,126.68906249999999,58.5,2015,8,"Aug","YTD","NotPTM","Thu",7411.3101562499996]
["South Coast","Kinsly. N","Confections","Teatime Chocolate Biscuits",42243,107.97363281250001,41,2015,8,"Aug","YTD","NotPTM","Thu",4426.9189453125009]
["North Coast","Connely. K","Beverages","Guaraná Fantástica",42244,54.706640624999999,20,2015,8,"Aug","YTD","NotPTM","Fri",1094.1328125]
["East Coast","Johnson. A","Grains/Cereals","Gustaf's Knäckebröd",42244,54.706640624999999,94.5,2015,8,"Aug","YTD","NotPTM","Fri",5169.7775390625002]
["West Coast","Rooney. Y","Dairy Products","Mozzarella di Giovanni",42244,54.706640624999999,156.5,2015,8,"Aug","YTD","NotPTM","Fri",8561.5892578125004]
["South Coast","Moodley. L","Produce","Rössle Sauerkraut",42244,71.982421875,205,2015,8,"Aug","YTD","NotPTM","Fri",14756.396484375]
["East Coast","Bonders. P","Seafood","Nord-Ost Matjeshering",42245,107.97363281250001,116.5,2015,8,"Aug","YTD","NotPTM","Sat",12578.928222656252]
["East Coast","Peters. K","Meat/Poultry","Perth Pasties",42245,90.697851562499991,147.5,2015,8,"Aug","YTD","NotPTM","Sat",13377.933105468748]
["West Coast","Stanly. N","Meat/Poultry","Tourtière",42245,107.97363281250001,33.5,2015,8,"Aug","YTD","NotPTM","Sat",3617.1166992187505]
["North Coast","Dinnel. M","Grains/Cereals","Gustaf's Knäckebröd",42248,71.982421875,94.5,2015,9,"Sep","YTD","NotPTM","Tue",6802.3388671875]
["East Coast","Newson. L","Seafood","Nord-Ost Matjeshering",42248,7.1982421875,116.5,2015,9,"Sep","YTD","NotPTM","Tue",838.59521484375]
["West Coast","Numkin. M","Grains/Cereals","Singaporean Hokkien Fried Mee",42248,71.982421875,63,2015,9,"Sep","YTD","NotPTM","Tue",4534.892578125]
["West Coast","Toonly. S","Confections","Teatime Chocolate Biscuits",42248,43.189453125,41,2015,9,"Sep","YTD","NotPTM","Tue",1770.767578125]
["South Coast","Grooner. T","Dairy Products","Camembert Pierrot",42249,71.982421875,153,2015,9,"Sep","YTD","NotPTM","Wed",11013.310546875]
["East Coast","Perks. M","Beverages","Chartreuse verte",42249,71.982421875,81,2015,9,"Sep","YTD","NotPTM","Wed",5830.576171875]
["East Coast","Lavin. T","Condiments","Chef Anton's Cajun Seasoning",42249,43.189453125,99,2015,9,"Sep","YTD","NotPTM","Wed",4275.755859375]
["South Coast","Hannis. H","Confections","Pavlova",42249,107.97363281250001,78.5,2015,9,"Sep","YTD","NotPTM","Wed",8475.9301757812518]
["South Coast","Franly. S","Meat/Poultry","Tourtière",42249,21.5947265625,33.5,2015,9,"Sep","YTD","NotPTM","Wed",723.42333984375]
["North Coast","Edford. O","Seafood","Jack's New England Clam Chowder",42250,71.982421875,43,2015,9,"Sep","YTD","NotPTM","Thu",3095.244140625]
["North Coast","Altercon. C","Dairy Products","Camembert Pierrot",42251,107.97363281250001,153,2015,9,"Sep","YTD","NotPTM","Fri",16519.965820312504]
["South Coast","Jarison. P","Condiments","Genen Shouyu",42251,179.9560546875,69.5,2015,9,"Sep","YTD","NotPTM","Fri",12506.94580078125]
["North Coast","Atterson. P","Grains/Cereals","Gnocchi di nonna Alice",42251,162.68027343750001,171,2015,9,"Sep","YTD","NotPTM","Fri",27818.326757812501]
["South Coast","Ilknis. K","Condiments","Gula Malacca",42251,100.77539062500001,87.5,2015,9,"Sep","YTD","NotPTM","Fri",8817.8466796875018]
["West Coast","Pursly. U","Seafood","Jack's New England Clam Chowder",42251,86.37890625,43,2015,9,"Sep","YTD","NotPTM","Fri",3714.29296875]
["West Coast","Rooney. Y","Seafood","Spegesild",42251,162.68027343750001,54,2015,9,"Sep","YTD","NotPTM","Fri",8784.7347656250004]
["West Coast","Oddesy. Y","Produce","Tofu",42251,11.5171875,104.5,2015,9,"Sep","YTD","NotPTM","Fri",1203.54609375]
["North Coast","Oxford. D","Confections","Zaanse koeken",42251,57.5859375,42.5,2015,9,"Sep","YTD","NotPTM","Fri",2447.40234375]
["North Coast","Edford. O","Seafood","Boston Crab Meat",42252,338.3173828125,82.5,2015,9,"Sep","YTD","NotPTM","Sat",27911.18408203125]
["North Coast","Connely. K","Dairy Products","Camembert Pierrot",42252,198.67148437500003,153,2015,9,"Sep","YTD","NotPTM","Sat",30396.737109375004]
["West Coast","Stanly. N","Dairy Products","Gorgonzola Telino",42252,71.982421875,56,2015,9,"Sep","YTD","NotPTM","Sat",4031.015625]
["North Coast","Dinnel. M","Condiments","Original Frankfurter grüne Soße",42252,251.9384765625,58.5,2015,9,"Sep","YTD","NotPTM","Sat",14738.40087890625]
["West Coast","Toonly. S","Beverages","Outback Lager",42252,143.96484375,67.5,2015,9,"Sep","YTD","NotPTM","Sat",9717.626953125]
["South Coast","Kinsly. N","Confections","Sir Rodney's Scones",42252,215.94726562500003,45,2015,9,"Sep","YTD","NotPTM","Sat",9717.6269531250018]
["East Coast","Anderson. P","Confections","Sir Rodney's Marmalade",42255,76.301367187499991,364.5,2015,9,"Sep","YTD","NotPTM","Tue",27811.848339843746]
["East Coast","Johnson. A","Beverages","Chartreuse verte",42256,11.5171875,81,2015,9,"Sep","YTD","NotPTM","Wed",932.89218749999998]
["South Coast","Lumford. T","Seafood","Escargots de Bourgogne",42256,177.07675781250001,59.5,2015,9,"Sep","YTD","NotPTM","Wed",10536.067089843751]
["East Coast","Peters. K","Confections","Scottish Longbreads",42256,35.9912109375,56,2015,9,"Sep","YTD","NotPTM","Wed",2015.5078125]
["East Coast","Lavin. T","Seafood","Boston Crab Meat",42257,107.97363281250001,82.5,2015,9,"Sep","YTD","NotPTM","Thu",8907.8247070312518]
["South Coast","Moodley. L","Grains/Cereals","Gnocchi di nonna Alice",42257,43.189453125,171,2015,9,"Sep","YTD","NotPTM","Thu",7385.396484375]
["East Coast","Newson. L","Seafood","Ikura",42257,86.37890625,139.5,2015,9,"Sep","YTD","NotPTM","Thu",12049.857421875]
["South Coast","Franly. S","Condiments","Louisiana Fiery Hot Pepper Sauce",42257,54.706640624999999,94.5,2015,9,"Sep","YTD","NotPTM","Thu",5169.7775390625002]
["East Coast","Bonders. P","Produce","Manjimup Dried Apples",42257,71.982421875,238.5,2015,9,"Sep","YTD","NotPTM","Thu",17167.8076171875]
["West Coast","Numkin. M","Grains/Cereals","Singaporean Hokkien Fried Mee",42257,107.97363281250001,63,2015,9,"Sep","YTD","NotPTM","Thu",6802.3388671875009]
["South Coast","Hannis. H","Beverages","Lakkalikööri",42258,35.9912109375,81,2015,9,"Sep","YTD","NotPTM","Fri",2915.2880859375]
["South Coast","Ilknis. K","Produce","Manjimup Dried Apples",42258,71.982421875,238.5,2015,9,"Sep","YTD","NotPTM","Fri",17167.8076171875]
["South Coast","Grooner. T","Dairy Products","Raclette Courdavault",42258,4.3189453124999995,247.5,2015,9,"Sep","YTD","NotPTM","Fri",1068.9389648437498]
["North Coast","Altercon. C","Dairy Products","Fløtemysost",42259,50.387695312500007,96.5,{"$f":"YEAR(E1732)","v":2015},{"$f":"MONTH(E1732)","v":9},{"$f":"TEXT(E1732,\"mmm\")","v":"Sep"},{"$f":"IF(I1732<MONTH(TODAY()),\"YTD\",\"Not YTD\")","v":"YTD"},{"$f":"IF(AND(E1732>=EarliestDate,E1732<=MostRecentDate),\"Past12Months\",\"NotPTM\")","v":"NotPTM"},{"$f":"TEXT(E1732,\"ddd\")","v":"Sat"},{"$f":"F1732*G1732","v":4862.4125976562509}]
["East Coast","Perks. M","Dairy Products","Gudbrandsdalsost",42259,162.68027343750001,162,2015,9,"Sep","YTD","NotPTM","Sat",26354.204296874999]
["North Coast","Oxford. D","Condiments","Louisiana Fiery Hot Pepper Sauce",42259,35.9912109375,94.5,2015,9,"Sep","YTD","NotPTM","Sat",3401.16943359375]
["North Coast","Atterson. P","Meat/Poultry","Thüringer Rostbratwurst",42259,129.568359375,557,2015,9,"Sep","YTD","NotPTM","Sat",72169.576171875]
["West Coast","Oddesy. Y","Dairy Products","Gorgonzola Telino",42262,28.79296875,56,2015,9,"Sep","YTD","NotPTM","Tue",1612.40625]
["South Coast","Kinsly. N","Seafood","Inlagd Sill",42262,107.97363281250001,85.5,2015,9,"Sep","YTD","NotPTM","Tue",9231.7456054687518]
["South Coast","Jarison. P","Meat/Poultry","Pâté chinois",42262,14.396484375,108,2015,9,"Sep","YTD","NotPTM","Tue",1554.8203125]
["North Coast","Connely. K","Grains/Cereals","Wimmers gute Semmelknödel",42262,54.706640624999999,149.5,2015,9,"Sep","YTD","NotPTM","Tue",8178.6427734375002]
["South Coast","Lumford. T","Beverages","Laughing Lumberjack Lager",42263,90.697851562499991,63,2015,9,"Sep","YTD","NotPTM","Wed",5713.9646484374998]
["North Coast","Dinnel. M","Beverages","Rhönbräu Klosterbier",42263,90.697851562499991,34.5,2015,9,"Sep","YTD","NotPTM","Wed",3129.0758789062497]
["North Coast","Oxford. D","Seafood","Röd Kaviar",42263,179.9560546875,67.5,2015,9,"Sep","YTD","NotPTM","Wed",12147.03369140625]
["North Coast","Altercon. C","Seafood","Spegesild",42263,215.94726562500003,54,2015,9,"Sep","YTD","NotPTM","Wed",11661.152343750002]
["North Coast","Edford. O","Grains/Cereals","Tunnbröd",42263,115.171875,40.5,2015,9,"Sep","YTD","NotPTM","Wed",4664.4609375]
["West Coast","Stanly. N","Beverages","Côte de Blaye",42264,54.706640624999999,1185.5,2015,9,"Sep","YTD","NotPTM","Thu",64854.722460937497]
["West Coast","Rooney. Y","Dairy Products","Fløtemysost",42264,43.189453125,96.5,2015,9,"Sep","YTD","NotPTM","Thu",4167.7822265625]
["North Coast","Atterson. P","Condiments","Louisiana Fiery Hot Pepper Sauce",42264,43.189453125,94.5,2015,9,"Sep","YTD","NotPTM","Thu",4081.4033203125]
["West Coast","Pursly. U","Confections","Pavlova",42264,35.9912109375,78.5,2015,9,"Sep","YTD","NotPTM","Thu",2825.31005859375]
["East Coast","Anderson. P","Confections","Tarte au sucre",42264,35.9912109375,221.5,2015,9,"Sep","YTD","NotPTM","Thu",7972.05322265625]
["North Coast","Connely. K","Beverages","Ipoh Coffee",42265,21.5947265625,207,2015,9,"Sep","YTD","NotPTM","Fri",4470.1083984375]
["South Coast","Moodley. L","Confections","Pavlova",42265,11.5171875,78.5,2015,9,"Sep","YTD","NotPTM","Fri",904.09921874999998]
["West Coast","Toonly. S","Grains/Cereals","Singaporean Hokkien Fried Mee",42265,21.5947265625,63,2015,9,"Sep","YTD","NotPTM","Fri",1360.4677734375]
["South Coast","Franly. S","Grains/Cereals","Tunnbröd",42265,18.715429687499999,40.5,2015,9,"Sep","YTD","NotPTM","Fri",757.97490234374993]
["West Coast","Numkin. M","Seafood","Escargots de Bourgogne",42266,107.97363281250001,59.5,2015,9,"Sep","YTD","NotPTM","Sat",6424.4311523437509]
["South Coast","Grooner. T","Meat/Poultry","Perth Pasties",42266,35.9912109375,147.5,2015,9,"Sep","YTD","NotPTM","Sat",5308.70361328125]
["North Coast","Dinnel. M","Produce","Tofu",42266,107.97363281250001,104.5,2015,9,"Sep","YTD","NotPTM","Sat",11283.244628906252]
["East Coast","Johnson. A","Dairy Products","Geitost",42269,28.79296875,11,2015,9,"Sep","YTD","NotPTM","Tue",316.72265625]
["South Coast","Ilknis. K","Condiments","Gula Malacca",42269,76.301367187499991,87.5,2015,9,"Sep","YTD","NotPTM","Tue",6676.3696289062491]
["East Coast","Peters. K","Confections","Gumbär Gummibärchen",42269,107.97363281250001,140.5,2015,9,"Sep","YTD","NotPTM","Tue",15170.295410156252]
["South Coast","Hannis. H","Seafood","Ikura",42269,7.1982421875,139.5,2015,9,"Sep","YTD","NotPTM","Tue",1004.15478515625]
["North Coast","Edford. O","Confections","Teatime Chocolate Biscuits",42269,25.913671875000002,41,2015,9,"Sep","YTD","NotPTM","Tue",1062.4605468750001]
["South Coast","Jarison. P","Dairy Products","Geitost",42270,107.97363281250001,11,2015,9,"Sep","YTD","NotPTM","Wed",1187.7099609375002]
["South Coast","Kinsly. N","Seafood","Jack's New England Clam Chowder",42270,431.89453125000006,43,2015,9,"Sep","YTD","NotPTM","Wed",18571.464843750004]
["East Coast","Newson. L","Dairy Products","Queso Manchego La Pastora",42270,359.912109375,171,2015,9,"Sep","YTD","NotPTM","Wed",61544.970703125]
["East Coast","Bonders. P","Dairy Products","Raclette Courdavault",42270,43.189453125,247.5,2015,9,"Sep","YTD","NotPTM","Wed",10689.3896484375]
["North Coast","Oxford. D","Meat/Poultry","Tourtière",42270,107.97363281250001,33.5,2015,9,"Sep","YTD","NotPTM","Wed",3617.1166992187505]
["North Coast","Altercon. C","Dairy Products","Gorgonzola Telino",42271,71.982421875,56,2015,9,"Sep","YTD","NotPTM","Thu",4031.015625]
["West Coast","Oddesy. Y","Confections","Pavlova",42271,179.9560546875,78.5,2015,9,"Sep","YTD","NotPTM","Thu",14126.55029296875]
["East Coast","Lavin. T","Grains/Cereals","Singaporean Hokkien Fried Mee",42271,143.96484375,63,2015,9,"Sep","YTD","NotPTM","Thu",9069.78515625]
["South Coast","Moodley. L","Dairy Products","Geitost",42272,107.97363281250001,11,2015,9,"Sep","YTD","NotPTM","Fri",1187.7099609375002]
["North Coast","Atterson. P","Condiments","Louisiana Hot Spiced Okra",42272,14.396484375,76.5,2015,9,"Sep","YTD","NotPTM","Fri",1101.3310546875]
["West Coast","Pursly. U","Beverages","Rhönbräu Klosterbier",42272,107.97363281250001,34.5,2015,9,"Sep","YTD","NotPTM","Fri",3725.0903320312505]
["South Coast","Lumford. T","Confections","Sir Rodney's Scones",42272,43.189453125,45,2015,9,"Sep","YTD","NotPTM","Fri",1943.525390625]
["East Coast","Perks. M","Confections","Teatime Chocolate Biscuits",42272,107.97363281250001,41,2015,9,"Sep","YTD","NotPTM","Fri",4426.9189453125009]
["North Coast","Connely. K","Grains/Cereals","Wimmers gute Semmelknödel",42272,100.77539062500001,149.5,2015,9,"Sep","YTD","NotPTM","Fri",15065.920898437502]
["West Coast","Rooney. Y","Seafood","Boston Crab Meat",42273,71.982421875,82.5,2015,9,"Sep","YTD","NotPTM","Sat",5938.5498046875]
["North Coast","Dinnel. M","Dairy Products","Camembert Pierrot",42273,107.97363281250001,153,2015,9,"Sep","YTD","NotPTM","Sat",16519.965820312504]
["East Coast","Anderson. P","Grains/Cereals","Filo Mix",42273,33.111914062499999,31.5,2015,9,"Sep","YTD","NotPTM","Sat",1043.0252929687499]
["South Coast","Franly. S","Confections","Zaanse koeken",42273,143.96484375,42.5,2015,9,"Sep","YTD","NotPTM","Sat",6118.505859375]
["East Coast","Peters. K","Seafood","Ikura",42276,71.982421875,139.5,2015,9,"Sep","YTD","NotPTM","Tue",10041.5478515625]
["West Coast","Stanly. N","Seafood","Jack's New England Clam Chowder",42276,14.396484375,43,2015,9,"Sep","YTD","NotPTM","Tue",619.048828125]
["East Coast","Johnson. A","Confections","Zaanse koeken",42276,54.706640624999999,42.5,2015,9,"Sep","YTD","NotPTM","Tue",2325.0322265625]
["West Coast","Toonly. S","Meat/Poultry","Alice Mutton",42277,107.97363281250001,175.5,2015,9,"Sep","YTD","NotPTM","Wed",18949.372558593754]
["South Coast","Grooner. T","Confections","Gumbär Gummibärchen",42277,54.706640624999999,140.5,2015,9,"Sep","YTD","NotPTM","Wed",7686.2830078124998]
["East Coast","Bonders. P","Seafood","Inlagd Sill",42277,21.5947265625,85.5,2015,9,"Sep","YTD","NotPTM","Wed",1846.34912109375]
["East Coast","Newson. L","Meat/Poultry","Mishi Kobe Niku",42277,179.9560546875,436.5,2015,9,"Sep","YTD","NotPTM","Wed",78550.81787109375]
["North Coast","Edford. O","Meat/Poultry","Thüringer Rostbratwurst",42277,35.9912109375,557,2015,9,"Sep","YTD","NotPTM","Wed",20047.1044921875]
["North Coast","Oxford. D","Beverages","Chai",42278,110.85292968749999,81,2015,10,"Oct","Not YTD","NotPTM","Thu",8979.0873046875004]
["South Coast","Hannis. H","Seafood","Ikura",42278,56.6861572265625,139.5,2015,10,"Oct","Not YTD","NotPTM","Thu",7907.7189331054688]
["West Coast","Oddesy. Y","Produce","Rössle Sauerkraut",42278,188.95385742187503,205,2015,10,"Oct","Not YTD","NotPTM","Thu",38735.540771484382]
["West Coast","Numkin. M","Beverages","Sasquatch Ale",42278,44.089233398437507,63,2015,10,"Oct","Not YTD","NotPTM","Thu",2777.621704101563]
["South Coast","Ilknis. K","Grains/Cereals","Gnocchi di nonna Alice",42279,62.984619140625,171,2015,10,"Oct","Not YTD","NotPTM","Fri",10770.369873046875]
["East Coast","Lavin. T","Condiments","Original Frankfurter grüne Soße",42279,94.476928710937514,58.5,2015,10,"Oct","Not YTD","NotPTM","Fri",5526.9003295898447]
["South Coast","Kinsly. N","Beverages","Chai",42280,94.476928710937514,81,2015,10,"Oct","Not YTD","NotPTM","Sat",7652.6312255859384]
["South Coast","Jarison. P","Condiments","Gula Malacca",42280,75.58154296875,87.5,2015,10,"Oct","Not YTD","NotPTM","Sat",6613.385009765625]
["North Coast","Atterson. P","Beverages","Ipoh Coffee",42280,125.96923828125,207,{"$f":"YEAR(E1796)","v":2015},{"$f":"MONTH(E1796)","v":10},{"$f":"TEXT(E1796,\"mmm\")","v":"Oct"},{"$f":"IF(I1796<MONTH(TODAY()),\"YTD\",\"Not YTD\")","v":"Not YTD"},{"$f":"IF(AND(E1796>=EarliestDate,E1796<=MostRecentDate),\"Past12Months\",\"NotPTM\")","v":"NotPTM"},{"$f":"TEXT(E1796,\"ddd\")","v":"Sat"},{"$f":"F1796*G1796","v":26075.63232421875}]
["South Coast","Lumford. T","Confections","Tarte au sucre",42280,151.1630859375,221.5,2015,10,"Oct","Not YTD","NotPTM","Sat",33482.62353515625]
["West Coast","Pursly. U","Meat/Poultry","Thüringer Rostbratwurst",42280,125.96923828125,557,2015,10,"Oct","Not YTD","NotPTM","Sat",70164.86572265625]
["North Coast","Altercon. C","Condiments","Vegie-spread",42280,62.984619140625,197.5,2015,10,"Oct","Not YTD","NotPTM","Sat",12439.462280273438]
["North Coast","Dinnel. M","Dairy Products","Gudbrandsdalsost",42283,94.476928710937514,162,2015,10,"Oct","Not YTD","NotPTM","Tue",15305.262451171877]
["South Coast","Moodley. L","Meat/Poultry","Mishi Kobe Niku",42283,18.8953857421875,436.5,2015,10,"Oct","Not YTD","NotPTM","Tue",8247.8358764648438]
["South Coast","Franly. S","Beverages","Outback Lager",42283,157.4615478515625,67.5,2015,10,"Oct","Not YTD","NotPTM","Tue",10628.654479980469]
["West Coast","Rooney. Y","Dairy Products","Raclette Courdavault",42283,79.360620117187494,247.5,2015,10,"Oct","Not YTD","NotPTM","Tue",19641.753479003906]
["North Coast","Connely. K","Seafood","Röd Kaviar",42283,47.868310546875001,67.5,2015,10,"Oct","Not YTD","NotPTM","Tue",3231.1109619140625]
["East Coast","Perks. M","Meat/Poultry","Tourtière",42283,188.95385742187503,33.5,2015,10,"Oct","Not YTD","NotPTM","Tue",6329.9542236328134]
["South Coast","Grooner. T","Produce","Uncle Bob's Organic Dried Pears",42283,283.4307861328125,135,2015,10,"Oct","Not YTD","NotPTM","Tue",38263.156127929688]
["West Coast","Toonly. S","Beverages","Guaraná Fantástica",42284,62.984619140625,20,2015,10,"Oct","Not YTD","NotPTM","Wed",1259.6923828125]
["West Coast","Stanly. N","Condiments","Northwoods Cranberry Sauce",42284,31.4923095703125,180,2015,10,"Oct","Not YTD","NotPTM","Wed",5668.61572265625]
["East Coast","Anderson. P","Dairy Products","Queso Manchego La Pastora",42284,12.596923828125,171,2015,10,"Oct","Not YTD","NotPTM","Wed",2154.073974609375]
["East Coast","Johnson. A","Meat/Poultry","Alice Mutton",42285,62.984619140625,175.5,2015,10,"Oct","Not YTD","NotPTM","Thu",11053.800659179688]
["East Coast","Peters. K","Seafood","Escargots de Bourgogne",42285,94.476928710937514,59.5,2015,10,"Oct","Not YTD","NotPTM","Thu",5621.3772583007822]
["West Coast","Oddesy. Y","Beverages","Outback Lager",42285,94.476928710937514,67.5,2015,10,"Oct","Not YTD","NotPTM","Thu",6377.1926879882822]
["North Coast","Edford. O","Seafood","Spegesild",42285,56.6861572265625,54,2015,10,"Oct","Not YTD","NotPTM","Thu",3061.052490234375]
["South Coast","Hannis. H","Beverages","Steeleye Stout",42285,28.972924804687498,81,2015,10,"Oct","Not YTD","NotPTM","Thu",2346.8069091796874]
["West Coast","Numkin. M","Confections","Teatime Chocolate Biscuits",42285,22.674462890625001,41,2015,10,"Oct","Not YTD","NotPTM","Thu",929.65297851562502]
["North Coast","Oxford. D","Meat/Poultry","Alice Mutton",42286,25.19384765625,175.5,2015,10,"Oct","Not YTD","NotPTM","Fri",4421.520263671875]
["North Coast","Atterson. P","Condiments","Louisiana Fiery Hot Pepper Sauce",42286,205.32985839843749,94.5,2015,10,"Oct","Not YTD","NotPTM","Fri",19403.671618652344]
["South Coast","Ilknis. K","Beverages","Outback Lager",42286,25.19384765625,67.5,2015,10,"Oct","Not YTD","NotPTM","Fri",1700.584716796875]
["West Coast","Rooney. Y","Dairy Products","Queso Cabrales",42286,47.868310546875001,94.5,2015,10,"Oct","Not YTD","NotPTM","Fri",4523.5553466796873]
["West Coast","Pursly. U","Meat/Poultry","Thüringer Rostbratwurst",42286,37.790771484375,557,2015,10,"Oct","Not YTD","NotPTM","Fri",21049.459716796875]
["North Coast","Altercon. C","Confections","Zaanse koeken",42286,37.790771484375,42.5,2015,10,"Oct","Not YTD","NotPTM","Fri",1606.1077880859375]
["North Coast","Connely. K","Beverages","Chai",42287,16.376000976562498,81,2015,10,"Oct","Not YTD","NotPTM","Sat",1326.4560791015624]
["South Coast","Jarison. P","Dairy Products","Fløtemysost",42287,188.95385742187503,96.5,2015,10,"Oct","Not YTD","NotPTM","Sat",18234.047241210941]
["East Coast","Bonders. P","Beverages","Sasquatch Ale",42287,37.790771484375,63,2015,10,"Oct","Not YTD","NotPTM","Sat",2380.818603515625]
["East Coast","Newson. L","Confections","Scottish Longbreads",42287,125.96923828125,56,2015,10,"Oct","Not YTD","NotPTM","Sat",7054.27734375]
["North Coast","Dinnel. M","Condiments","Aniseed Syrup",42290,18.8953857421875,45,2015,10,"Oct","Not YTD","NotPTM","Tue",850.2923583984375]
["South Coast","Kinsly. N","Dairy Products","Fløtemysost",42290,62.984619140625,96.5,2015,10,"Oct","Not YTD","NotPTM","Tue",6078.0157470703125]
["North Coast","Oxford. D","Beverages","Lakkalikööri",42290,157.4615478515625,81,2015,10,"Oct","Not YTD","NotPTM","Tue",12754.385375976563]
["North Coast","Edford. O","Dairy Products","Raclette Courdavault",42290,132.2677001953125,247.5,2015,10,"Oct","Not YTD","NotPTM","Tue",32736.255798339844]
["West Coast","Stanly. N","Beverages","Chang",42291,16.376000976562498,85.5,2015,10,"Oct","Not YTD","NotPTM","Wed",1400.1480834960935]
["West Coast","Toonly. S","Condiments","Chef Anton's Cajun Seasoning",42291,18.8953857421875,99,2015,10,"Oct","Not YTD","NotPTM","Wed",1870.6431884765625]
["North Coast","Altercon. C","Confections","Chocolade",42291,75.58154296875,57,2015,10,"Oct","Not YTD","NotPTM","Wed",4308.14794921875]
["West Coast","Numkin. M","Beverages","Guaraná Fantástica",42291,110.85292968749999,20,2015,10,"Oct","Not YTD","NotPTM","Wed",2217.05859375]
["East Coast","Lavin. T","Dairy Products","Raclette Courdavault",42291,110.85292968749999,247.5,2015,10,"Oct","Not YTD","NotPTM","Wed",27436.10009765625]
["South Coast","Lumford. T","Seafood","Röd Kaviar",42291,110.85292968749999,67.5,2015,10,"Oct","Not YTD","NotPTM","Wed",7482.57275390625]
["North Coast","Atterson. P","Dairy Products","Gorgonzola Telino",42292,62.984619140625,56,2015,10,"Oct","Not YTD","NotPTM","Thu",3527.138671875]
["South Coast","Moodley. L","Dairy Products","Mascarpone Fabioli",42292,12.596923828125,144,2015,10,"Oct","Not YTD","NotPTM","Thu",1813.95703125]
["West Coast","Rooney. Y","Beverages","Ipoh Coffee",42293,75.58154296875,207,2015,10,"Oct","Not YTD","NotPTM","Fri",15645.37939453125]
["West Coast","Stanly. N","Beverages","Outback Lager",42293,88.178466796875014,67.5,2015,10,"Oct","Not YTD","NotPTM","Fri",5952.0465087890634]
["North Coast","Connely. K","Meat/Poultry","Pâté chinois",42293,66.763696289062494,108,2015,10,"Oct","Not YTD","NotPTM","Fri",7210.4791992187493]
["West Coast","Pursly. U","Confections","Pavlova",42293,62.984619140625,78.5,2015,10,"Oct","Not YTD","NotPTM","Fri",4944.2926025390625]
["West Coast","Oddesy. Y","Dairy Products","Raclette Courdavault",42293,25.19384765625,247.5,2015,10,"Oct","Not YTD","NotPTM","Fri",6235.477294921875]
["South Coast","Franly. S","Grains/Cereals","Ravioli Angelo",42293,125.96923828125,87.5,2015,10,"Oct","Not YTD","NotPTM","Fri",11022.308349609375]
["East Coast","Anderson. P","Dairy Products","Camembert Pierrot",42294,31.4923095703125,153,2015,10,"Oct","Not YTD","NotPTM","Sat",4818.3233642578125]
["North Coast","Dinnel. M","Condiments","Chef Anton's Gumbo Mix",42294,12.596923828125,96,2015,10,"Oct","Not YTD","NotPTM","Sat",1209.3046875]
["East Coast","Perks. M","Seafood","Inlagd Sill",42294,16.376000976562498,85.5,2015,10,"Oct","Not YTD","NotPTM","Sat",1400.1480834960935]
["East Coast","Johnson. A","Produce","Manjimup Dried Apples",42294,88.178466796875014,238.5,2015,10,"Oct","Not YTD","NotPTM","Sat",21030.564331054691]
["North Coast","Edford. O","Condiments","Northwoods Cranberry Sauce",42294,125.96923828125,180,2015,10,"Oct","Not YTD","NotPTM","Sat",22674.462890625]
["South Coast","Grooner. T","Confections","Teatime Chocolate Biscuits",42297,16.376000976562498,41,2015,10,"Oct","Not YTD","NotPTM","Tue",671.41604003906241]
["North Coast","Oxford. D","Confections","Zaanse koeken",42297,16.376000976562498,42.5,2015,10,"Oct","Not YTD","NotPTM","Tue",695.98004150390614]
["South Coast","Ilknis. K","Grains/Cereals","Gnocchi di nonna Alice",42298,94.476928710937514,171,2015,10,"Oct","Not YTD","NotPTM","Wed",16155.554809570314]
["West Coast","Toonly. S","Seafood","Jack's New England Clam Chowder",42298,132.2677001953125,43,2015,10,"Oct","Not YTD","NotPTM","Wed",5687.5111083984375]
["West Coast","Numkin. M","Meat/Poultry","Perth Pasties",42298,387.98525390624997,147.5,2015,10,"Oct","Not YTD","NotPTM","Wed",57227.824951171868]
["South Coast","Hannis. H","Confections","Teatime Chocolate Biscuits",42298,37.790771484375,41,2015,10,"Oct","Not YTD","NotPTM","Wed",1549.421630859375]
["East Coast","Newson. L","Meat/Poultry","Alice Mutton",42299,85.659082031250009,175.5,2015,10,"Oct","Not YTD","NotPTM","Thu",15033.168896484376]
["North Coast","Atterson. P","Beverages","Chang",42299,94.476928710937514,85.5,2015,10,"Oct","Not YTD","NotPTM","Thu",8077.7774047851572]
["North Coast","Altercon. C","Seafood","Escargots de Bourgogne",42299,37.790771484375,59.5,2015,10,"Oct","Not YTD","NotPTM","Thu",2248.5509033203125]
["West Coast","Oddesy. Y","Grains/Cereals","Gnocchi di nonna Alice",42299,56.6861572265625,171,2015,10,"Oct","Not YTD","NotPTM","Thu",9693.3328857421875]
["West Coast","Pursly. U","Confections","Gumbär Gummibärchen",42299,94.476928710937514,140.5,2015,10,"Oct","Not YTD","NotPTM","Thu",13274.008483886721]
["East Coast","Peters. K","Seafood","Ikura",42299,56.6861572265625,139.5,{"$f":"YEAR(E1860)","v":2015},{"$f":"MONTH(E1860)","v":10},{"$f":"TEXT(E1860,\"mmm\")","v":"Oct"},{"$f":"IF(I1860<MONTH(TODAY()),\"YTD\",\"Not YTD\")","v":"Not YTD"},{"$f":"IF(AND(E1860>=EarliestDate,E1860<=MostRecentDate),\"Past12Months\",\"NotPTM\")","v":"NotPTM"},{"$f":"TEXT(E1860,\"ddd\")","v":"Thu"},{"$f":"F1860*G1860","v":7907.7189331054688}]
["South Coast","Jarison. P","Seafood","Røgede sild",42299,346.41540527343756,42.5,2015,10,"Oct","Not YTD","NotPTM","Thu",14722.654724121096]
["East Coast","Bonders. P","Seafood","Spegesild",42299,75.58154296875,54,2015,10,"Oct","Not YTD","NotPTM","Thu",4081.4033203125]
["West Coast","Rooney. Y","Confections","Zaanse koeken",42299,157.4615478515625,42.5,2015,10,"Oct","Not YTD","NotPTM","Thu",6692.1157836914063]
["East Coast","Lavin. T","Dairy Products","Fløtemysost",42300,94.476928710937514,96.5,2015,10,"Oct","Not YTD","NotPTM","Fri",9117.0236206054706]
["West Coast","Stanly. N","Seafood","Ikura",42300,66.763696289062494,139.5,2015,10,"Oct","Not YTD","NotPTM","Fri",9313.5356323242177]
["East Coast","Johnson. A","Dairy Products","Gudbrandsdalsost",42301,79.360620117187494,162,2015,10,"Oct","Not YTD","NotPTM","Sat",12856.420458984374]
["East Coast","Perks. M","Produce","Manjimup Dried Apples",42301,22.674462890625001,238.5,2015,10,"Oct","Not YTD","NotPTM","Sat",5407.8593994140629]
["South Coast","Lumford. T","Confections","Sir Rodney's Scones",42301,117.15139160156251,45,2015,10,"Oct","Not YTD","NotPTM","Sat",5271.8126220703125]
["South Coast","Kinsly. N","Condiments","Sirop d'érable",42301,31.4923095703125,128,2015,10,"Oct","Not YTD","NotPTM","Sat",4031.015625]
["East Coast","Anderson. P","Meat/Poultry","Tourtière",42301,47.868310546875001,33.5,2015,10,"Oct","Not YTD","NotPTM","Sat",1603.5884033203126]
["West Coast","Toonly. S","Seafood","Carnarvon Tigers",42304,37.790771484375,281,2015,10,"Oct","Not YTD","NotPTM","Tue",10619.206787109375]
["East Coast","Bonders. P","Seafood","Inlagd Sill",42304,125.96923828125,85.5,2015,10,"Oct","Not YTD","NotPTM","Tue",10770.369873046875]
["North Coast","Connely. K","Seafood","Nord-Ost Matjeshering",42304,10.0775390625,116.5,2015,10,"Oct","Not YTD","NotPTM","Tue",1174.0333007812499]
["East Coast","Peters. K","Confections","Pavlova",42304,62.984619140625,78.5,2015,10,"Oct","Not YTD","NotPTM","Tue",4944.2926025390625]
["West Coast","Numkin. M","Dairy Products","Queso Manchego La Pastora",42304,113.372314453125,171,2015,10,"Oct","Not YTD","NotPTM","Tue",19386.665771484375]
["South Coast","Moodley. L","Confections","Tarte au sucre",42304,62.984619140625,221.5,2015,10,"Oct","Not YTD","NotPTM","Tue",13951.093139648438]
["West Coast","Oddesy. Y","Meat/Poultry","Tourtière",42304,125.96923828125,33.5,2015,10,"Oct","Not YTD","NotPTM","Tue",4219.969482421875]
["East Coast","Newson. L","Dairy Products","Fløtemysost",42305,25.19384765625,96.5,2015,10,"Oct","Not YTD","NotPTM","Wed",2431.206298828125]
["East Coast","Lavin. T","Beverages","Steeleye Stout",42305,66.763696289062494,81,2015,10,"Oct","Not YTD","NotPTM","Wed",5407.859399414062]
["West Coast","Pursly. U","Beverages","Chang",42306,10.0775390625,85.5,2015,10,"Oct","Not YTD","NotPTM","Thu",861.62958984374995]
["South Coast","Grooner. T","Dairy Products","Gorgonzola Telino",42306,157.4615478515625,56,2015,10,"Oct","Not YTD","NotPTM","Thu",8817.8466796875]
["East Coast","Anderson. P","Condiments","Gula Malacca",42306,157.4615478515625,87.5,2015,10,"Oct","Not YTD","NotPTM","Thu",13777.885437011719]
["East Coast","Perks. M","Beverages","Rhönbräu Klosterbier",42306,132.2677001953125,34.5,2015,10,"Oct","Not YTD","NotPTM","Thu",4563.2356567382813]
["South Coast","Franly. S","Confections","Scottish Longbreads",42306,142.34523925781249,56,2015,10,"Oct","Not YTD","NotPTM","Thu",7971.3333984374995]
["South Coast","Hannis. H","Confections","Gumbär Gummibärchen",42307,47.868310546875001,140.5,2015,10,"Oct","Not YTD","NotPTM","Fri",6725.4976318359377]
["West Coast","Stanly. N","Seafood","Ikura",42307,50.3876953125,139.5,2015,10,"Oct","Not YTD","NotPTM","Fri",7029.08349609375]
["West Coast","Rooney. Y","Condiments","Sirop d'érable",42307,16.376000976562498,128,2015,10,"Oct","Not YTD","NotPTM","Fri",2096.1281249999997]
["West Coast","Toonly. S","Grains/Cereals","Filo Mix",42308,12.596923828125,31.5,2015,10,"Oct","Not YTD","NotPTM","Sat",396.8031005859375]
["East Coast","Peters. K","Seafood","Jack's New England Clam Chowder",42308,37.790771484375,43,2015,10,"Oct","Not YTD","NotPTM","Sat",1625.003173828125]
["East Coast","Johnson. A","Meat/Poultry","Pâté chinois",42308,18.8953857421875,108,2015,10,"Oct","Not YTD","NotPTM","Sat",2040.70166015625]
["North Coast","Edford. O","Meat/Poultry","Alice Mutton",42311,95.295728759765623,175.5,2015,11,"Nov","Not YTD","NotPTM","Tue",16724.400397338868]
["South Coast","Ilknis. K","Condiments","Chef Anton's Cajun Seasoning",42311,120.07261823730467,99,2015,11,"Nov","Not YTD","NotPTM","Tue",11887.189205493161]
["West Coast","Numkin. M","Grains/Cereals","Gnocchi di nonna Alice",42311,47.647864379882812,171,2015,11,"Nov","Not YTD","NotPTM","Tue",8147.7848089599611]
["East Coast","Bonders. P","Dairy Products","Queso Cabrales",42311,24.776889477539058,94.5,2015,11,"Nov","Not YTD","NotPTM","Tue",2341.416055627441]
["North Coast","Dinnel. M","Dairy Products","Raclette Courdavault",42311,47.647864379882812,247.5,2015,11,"Nov","Not YTD","NotPTM","Tue",11792.846434020996]
["South Coast","Jarison. P","Seafood","Boston Crab Meat",42312,28.588718627929687,82.5,2015,11,"Nov","Not YTD","NotPTM","Wed",2358.5692868041992]
["North Coast","Oxford. D","Dairy Products","Camembert Pierrot",42312,72.424753857421877,153,2015,11,"Nov","Not YTD","NotPTM","Wed",11080.987340185548]
["North Coast","Altercon. C","Beverages","Chai",42312,238.23932189941405,81,2015,11,"Nov","Not YTD","NotPTM","Wed",19297.38507385254]
["West Coast","Oddesy. Y","Seafood","Nord-Ost Matjeshering",42312,72.424753857421877,116.5,2015,11,"Nov","Not YTD","NotPTM","Wed",8437.4838243896484]
["South Coast","Kinsly. N","Meat/Poultry","Pâté chinois",42312,57.177437255859374,108,2015,11,"Nov","Not YTD","NotPTM","Wed",6175.1632236328123]
["South Coast","Lumford. T","Confections","Sir Rodney's Scones",42312,142.94359313964844,45,2015,11,"Nov","Not YTD","NotPTM","Wed",6432.4616912841802]
["South Coast","Moodley. L","Confections","Valkoinen suklaa",42312,190.59145751953125,73,2015,11,"Nov","Not YTD","NotPTM","Wed",13913.176398925782]
["East Coast","Newson. L","Dairy Products","Gorgonzola Telino",42313,15.247316601562499,56,2015,11,"Nov","Not YTD","NotPTM","Thu",853.84972968749992]
["East Coast","Lavin. T","Condiments","Louisiana Fiery Hot Pepper Sauce",42313,47.647864379882812,94.5,2015,11,"Nov","Not YTD","NotPTM","Thu",4502.7231838989255]
["East Coast","Perks. M","Confections","Pavlova",42313,72.424753857421877,78.5,2015,11,"Nov","Not YTD","NotPTM","Thu",5685.3431778076174]
["West Coast","Pursly. U","Beverages","Lakkalikööri",42314,95.295728759765623,81,2015,11,"Nov","Not YTD","NotPTM","Fri",7718.9540295410152]
["North Coast","Atterson. P","Produce","Manjimup Dried Apples",42314,142.94359313964844,238.5,2015,11,"Nov","Not YTD","NotPTM","Fri",34092.046963806155]
["North Coast","Connely. K","Confections","Sir Rodney's Scones",42314,190.59145751953125,45,2015,11,"Nov","Not YTD","NotPTM","Fri",8576.615588378907]
["North Coast","Dinnel. M","Grains/Cereals","Filo Mix",42315,120.07261823730467,31.5,2015,11,"Nov","Not YTD","NotPTM","Sat",3782.287474475097]
["West Coast","Rooney. Y","Condiments","Grandma's Boysenberry Spread",42315,142.94359313964844,112.5,2015,11,"Nov","Not YTD","NotPTM","Sat",16081.154228210449]
["East Coast","Johnson. A","Beverages","Lakkalikööri",42315,95.295728759765623,81,2015,11,"Nov","Not YTD","NotPTM","Sat",7718.9540295410152]
["South Coast","Franly. S","Seafood","Nord-Ost Matjeshering",42315,72.424753857421877,116.5,2015,11,"Nov","Not YTD","NotPTM","Sat",8437.4838243896484]
["South Coast","Grooner. T","Produce","Rössle Sauerkraut",42315,95.295728759765623,205,2015,11,"Nov","Not YTD","NotPTM","Sat",19535.624395751955]
["East Coast","Anderson. P","Produce","Tofu",42315,76.236583007812499,104.5,2015,11,"Nov","Not YTD","NotPTM","Sat",7966.7229243164065]
["North Coast","Edford. O","Condiments","Original Frankfurter grüne Soße",42318,9.5295728759765623,58.5,2015,11,"Nov","Not YTD","NotPTM","Tue",557.48001324462894]
["North Coast","Oxford. D","Condiments","Sirop d'érable",42318,95.295728759765623,128,2015,11,"Nov","Not YTD","NotPTM","Tue",12197.85328125]
["North Coast","Altercon. C","Seafood","Jack's New England Clam Chowder",42319,57.177437255859374,43,2015,11,"Nov","Not YTD","NotPTM","Wed",2458.6298020019531]
["East Coast","Peters. K","Seafood","Konbu",42319,19.059145751953125,27,2015,11,"Nov","Not YTD","NotPTM","Wed",514.59693530273432]
["West Coast","Toonly. S","Condiments","Louisiana Fiery Hot Pepper Sauce",42319,190.59145751953125,94.5,2015,11,"Nov","Not YTD","NotPTM","Wed",18010.892735595702]
["West Coast","Stanly. N","Beverages","Rhönbräu Klosterbier",42319,95.295728759765623,34.5,2015,11,"Nov","Not YTD","NotPTM","Wed",3287.7026422119138]
["South Coast","Ilknis. K","Grains/Cereals","Filo Mix",42320,85.766155883789054,31.5,2015,11,"Nov","Not YTD","NotPTM","Thu",2701.6339103393552]
["North Coast","Atterson. P","Seafood","Inlagd Sill",42320,28.588718627929687,85.5,2015,11,"Nov","Not YTD","NotPTM","Thu",2444.3354426879882]
["South Coast","Hannis. H","Confections","Pavlova",42320,15.247316601562499,78.5,2015,11,"Nov","Not YTD","NotPTM","Thu",1196.9143532226562]
["East Coast","Bonders. P","Grains/Cereals","Gnocchi di nonna Alice",42321,66.707010131835943,171,{"$f":"YEAR(E1924)","v":2015},{"$f":"MONTH(E1924)","v":11},{"$f":"TEXT(E1924,\"mmm\")","v":"Nov"},{"$f":"IF(I1924<MONTH(TODAY()),\"YTD\",\"Not YTD\")","v":"Not YTD"},{"$f":"IF(AND(E1924>=EarliestDate,E1924<=MostRecentDate),\"Past12Months\",\"NotPTM\")","v":"NotPTM"},{"$f":"TEXT(E1924,\"ddd\")","v":"Fri"},{"$f":"F1924*G1924","v":11406.898732543947}]
["East Coast","Newson. L","Seafood","Røgede sild",42321,190.59145751953125,42.5,2015,11,"Nov","Not YTD","NotPTM","Fri",8100.1369445800783]
["South Coast","Jarison. P","Produce","Rössle Sauerkraut",42321,24.776889477539058,205,2015,11,"Nov","Not YTD","NotPTM","Fri",5079.2623428955067]
["North Coast","Connely. K","Beverages","Steeleye Stout",42321,167.72048261718749,81,2015,11,"Nov","Not YTD","NotPTM","Fri",13585.359091992186]
["East Coast","Lavin. T","Condiments","Aniseed Syrup",42322,95.295728759765623,45,2015,11,"Nov","Not YTD","NotPTM","Sat",4288.3077941894535]
["West Coast","Oddesy. Y","Dairy Products","Camembert Pierrot",42322,238.23932189941405,153,2015,11,"Nov","Not YTD","NotPTM","Sat",36450.61625061035]
["North Coast","Dinnel. M","Beverages","Chang",42322,72.424753857421877,85.5,2015,11,"Nov","Not YTD","NotPTM","Sat",6192.3164548095701]
["West Coast","Numkin. M","Dairy Products","Mozzarella di Giovanni",42322,167.72048261718749,156.5,2015,11,"Nov","Not YTD","NotPTM","Sat",26248.255529589842]
["East Coast","Perks. M","Seafood","Boston Crab Meat",42325,238.23932189941405,82.5,2015,11,"Nov","Not YTD","NotPTM","Tue",19654.74405670166]
["South Coast","Kinsly. N","Seafood","Spegesild",42325,133.41402026367189,54,2015,11,"Nov","Not YTD","NotPTM","Tue",7204.3570942382821]
["South Coast","Franly. S","Seafood","Carnarvon Tigers",42326,114.35487451171875,281,2015,11,"Nov","Not YTD","NotPTM","Wed",32133.71973779297]
["South Coast","Moodley. L","Condiments","Gula Malacca",42326,76.236583007812499,87.5,2015,11,"Nov","Not YTD","NotPTM","Wed",6670.7010131835932]
["South Coast","Lumford. T","Dairy Products","Mozzarella di Giovanni",42326,34.306462353515627,156.5,2015,11,"Nov","Not YTD","NotPTM","Wed",5368.9613583251958]
["North Coast","Edford. O","Dairy Products","Raclette Courdavault",42326,215.36834699707029,247.5,2015,11,"Nov","Not YTD","NotPTM","Wed",53303.665881774898]
["South Coast","Grooner. T","Dairy Products","Gorgonzola Telino",42327,38.118291503906249,56,2015,11,"Nov","Not YTD","NotPTM","Thu",2134.6243242187502]
["West Coast","Stanly. N","Dairy Products","Gudbrandsdalsost",42327,333.53505065917966,162,2015,11,"Nov","Not YTD","NotPTM","Thu",54032.678206787103]
["East Coast","Anderson. P","Seafood","Jack's New England Clam Chowder",42327,167.72048261718749,43,2015,11,"Nov","Not YTD","NotPTM","Thu",7211.9807525390615]
["West Coast","Pursly. U","Seafood","Konbu",42327,28.588718627929687,27,2015,11,"Nov","Not YTD","NotPTM","Thu",771.89540295410154]
["North Coast","Altercon. C","Grains/Cereals","Singaporean Hokkien Fried Mee",42327,133.41402026367189,63,2015,11,"Nov","Not YTD","NotPTM","Thu",8405.083276611329]
["West Coast","Rooney. Y","Confections","Tarte au sucre",42327,43.836035229492182,221.5,2015,11,"Nov","Not YTD","NotPTM","Thu",9709.681803332518]
["North Coast","Oxford. D","Condiments","Vegie-spread",42327,43.836035229492182,197.5,2015,11,"Nov","Not YTD","NotPTM","Thu",8657.6169578247063]
["South Coast","Ilknis. K","Seafood","Boston Crab Meat",42328,190.59145751953125,82.5,2015,11,"Nov","Not YTD","NotPTM","Fri",15723.795245361327]
["North Coast","Atterson. P","Grains/Cereals","Gnocchi di nonna Alice",42328,205.83877412109373,171,2015,11,"Nov","Not YTD","NotPTM","Fri",35198.43037470703]
["South Coast","Hannis. H","Beverages","Lakkalikööri",42328,47.647864379882812,81,2015,11,"Nov","Not YTD","NotPTM","Fri",3859.4770147705076]
["East Coast","Johnson. A","Dairy Products","Raclette Courdavault",42328,28.588718627929687,247.5,2015,11,"Nov","Not YTD","NotPTM","Fri",7075.7078604125973]
["West Coast","Toonly. S","Grains/Cereals","Tunnbröd",42328,209.65060327148436,40.5,2015,11,"Nov","Not YTD","NotPTM","Fri",8490.8494324951171]
["West Coast","Numkin. M","Dairy Products","Raclette Courdavault",42329,120.07261823730467,247.5,2015,11,"Nov","Not YTD","NotPTM","Sat",29717.973013732906]
["North Coast","Dinnel. M","Seafood","Røgede sild",42329,190.59145751953125,42.5,2015,11,"Nov","Not YTD","NotPTM","Sat",8100.1369445800783]
["North Coast","Connely. K","Produce","Tofu",42329,24.776889477539058,104.5,2015,11,"Nov","Not YTD","NotPTM","Sat",2589.1849504028314]
["North Coast","Oxford. D","Beverages","Chai",42332,38.118291503906249,81,2015,11,"Nov","Not YTD","NotPTM","Tue",3087.5816118164062]
["North Coast","Edford. O","Dairy Products","Gudbrandsdalsost",42332,15.247316601562499,162,2015,11,"Nov","Not YTD","NotPTM","Tue",2470.0652894531249]
["West Coast","Oddesy. Y","Confections","Gumbär Gummibärchen",42332,57.177437255859374,140.5,2015,11,"Nov","Not YTD","NotPTM","Tue",8033.4299344482424]
["East Coast","Peters. K","Seafood","Nord-Ost Matjeshering",42332,142.94359313964844,116.5,2015,11,"Nov","Not YTD","NotPTM","Tue",16652.928600769043]
["West Coast","Pursly. U","Seafood","Röd Kaviar",42332,72.424753857421877,67.5,2015,11,"Nov","Not YTD","NotPTM","Tue",4888.6708853759765]
["South Coast","Jarison. P","Confections","Valkoinen suklaa",42332,95.295728759765623,73,2015,11,"Nov","Not YTD","NotPTM","Tue",6956.5881994628908]
["West Coast","Rooney. Y","Seafood","Boston Crab Meat",42333,15.247316601562499,82.5,2015,11,"Nov","Not YTD","NotPTM","Wed",1257.9036196289062]
["West Coast","Stanly. N","Produce","Longlife Tofu",42333,24.776889477539058,45,2015,11,"Nov","Not YTD","NotPTM","Wed",1114.9600264892576]
["South Coast","Kinsly. N","Seafood","Røgede sild",42333,19.059145751953125,42.5,2015,11,"Nov","Not YTD","NotPTM","Wed",810.01369445800776]
["North Coast","Altercon. C","Grains/Cereals","Gnocchi di nonna Alice",42334,142.94359313964844,171,2015,11,"Nov","Not YTD","NotPTM","Thu",24443.354426879883]
["East Coast","Bonders. P","Dairy Products","Gudbrandsdalsost",42334,120.07261823730467,162,2015,11,"Nov","Not YTD","NotPTM","Thu",19451.764154443357]
["South Coast","Lumford. T","Grains/Cereals","Ravioli Angelo",42334,66.707010131835943,87.5,2015,11,"Nov","Not YTD","NotPTM","Thu",5836.8633865356451]
["South Coast","Moodley. L","Confections","Zaanse koeken",42334,142.94359313964844,42.5,2015,11,"Nov","Not YTD","NotPTM","Thu",6075.102708435059]
["South Coast","Grooner. T","Seafood","Carnarvon Tigers",42335,101.01347248535154,281,2015,11,"Nov","Not YTD","NotPTM","Fri",28384.785768383783]
["North Coast","Connely. K","Dairy Products","Gudbrandsdalsost",42335,95.295728759765623,162,2015,11,"Nov","Not YTD","NotPTM","Fri",15437.90805908203]
["West Coast","Toonly. S","Seafood","Inlagd Sill",42335,95.295728759765623,85.5,2015,11,"Nov","Not YTD","NotPTM","Fri",8147.7848089599611]
["North Coast","Atterson. P","Dairy Products","Raclette Courdavault",42335,34.306462353515627,247.5,2015,11,"Nov","Not YTD","NotPTM","Fri",8490.8494324951171]
["West Coast","Numkin. M","Beverages","Sasquatch Ale",42335,142.94359313964844,63,2015,11,"Nov","Not YTD","NotPTM","Fri",9005.4463677978511]
["South Coast","Franly. S","Confections","Scottish Longbreads",42335,28.588718627929687,56,2015,11,"Nov","Not YTD","NotPTM","Fri",1600.9682431640624]
["East Coast","Newson. L","Confections","Tarte au sucre",42335,142.94359313964844,221.5,2015,11,"Nov","Not YTD","NotPTM","Fri",31662.005880432131]
["North Coast","Dinnel. M","Grains/Cereals","Wimmers gute Semmelknödel",42335,114.35487451171875,149.5,2015,11,"Nov","Not YTD","NotPTM","Fri",17096.053739501953]
["North Coast","Oxford. D","Grains/Cereals","Filo Mix",42336,285.88718627929688,31.5,2015,11,"Nov","Not YTD","NotPTM","Sat",9005.4463677978511]
["East Coast","Lavin. T","Confections","Gumbär Gummibärchen",42336,95.295728759765623,140.5,2015,11,"Nov","Not YTD","NotPTM","Sat",13389.04989074707]
["North Coast","Edford. O","Dairy Products","Mascarpone Fabioli",42336,47.647864379882812,144,2015,11,"Nov","Not YTD","NotPTM","Sat",6861.2924707031252]
["West Coast","Oddesy. Y","Beverages","Outback Lager",42336,190.59145751953125,67.5,2015,11,"Nov","Not YTD","NotPTM","Sat",12864.923382568359]
["South Coast","Hannis. H","Beverages","Ipoh Coffee",42339,107.97363281250001,207,2015,12,"Dec","Not YTD","NotPTM","Tue",22350.541992187504]
["East Coast","Perks. M","Confections","NuNuCa Nuß-Nougat-Creme",42339,43.189453125,63,2015,12,"Dec","Not YTD","NotPTM","Tue",2720.935546875]
["East Coast","Anderson. P","Confections","Schoggi Schokolade",42339,143.96484375,197.5,2015,12,"Dec","Not YTD","NotPTM","Tue",28433.056640625]
["North Coast","Altercon. C","Beverages","Chartreuse verte",42340,57.5859375,81,2015,12,"Dec","Not YTD","NotPTM","Wed",4664.4609375]
["West Coast","Rooney. Y","Grains/Cereals","Gnocchi di nonna Alice",42340,215.94726562500003,171,2015,12,"Dec","Not YTD","NotPTM","Wed",36926.982421875007]
["West Coast","Pursly. U","Produce","Manjimup Dried Apples",42340,100.77539062500001,238.5,2015,12,"Dec","Not YTD","NotPTM","Wed",24034.930664062504]
["South Coast","Ilknis. K","Confections","NuNuCa Nuß-Nougat-Creme",42340,126.68906249999999,63,2015,12,"Dec","Not YTD","NotPTM","Wed",7981.4109374999998]
["North Coast","Atterson. P","Beverages","Rhönbräu Klosterbier",42340,64.7841796875,34.5,2015,12,"Dec","Not YTD","NotPTM","Wed",2235.05419921875]
["North Coast","Connely. K","Confections","Zaanse koeken",42340,107.97363281250001,42.5,2015,12,"Dec","Not YTD","NotPTM","Wed",4588.8793945312509]
["North Coast","Edford. O","Condiments","Aniseed Syrup",42341,71.982421875,45,2015,12,"Dec","Not YTD","NotPTM","Thu",3239.208984375]
["East Coast","Johnson. A","Beverages","Chartreuse verte",42341,467.8857421875,81,{"$f":"YEAR(E1988)","v":2015},{"$f":"MONTH(E1988)","v":12},{"$f":"TEXT(E1988,\"mmm\")","v":"Dec"},{"$f":"IF(I1988<MONTH(TODAY()),\"YTD\",\"Not YTD\")","v":"Not YTD"},{"$f":"IF(AND(E1988>=EarliestDate,E1988<=MostRecentDate),\"Past12Months\",\"NotPTM\")","v":"NotPTM"},{"$f":"TEXT(E1988,\"ddd\")","v":"Thu"},{"$f":"F1988*G1988","v":37898.7451171875}]
["South Coast","Jarison. P","Beverages","Guaraná Fantástica",42341,71.982421875,20,2015,12,"Dec","Not YTD","NotPTM","Thu",1439.6484375]
["North Coast","Dinnel. M","Grains/Cereals","Gustaf's Knäckebröd",42341,21.5947265625,94.5,2015,12,"Dec","Not YTD","NotPTM","Thu",2040.70166015625]
["South Coast","Kinsly. N","Confections","Sir Rodney's Scones",42341,143.96484375,45,2015,12,"Dec","Not YTD","NotPTM","Thu",6478.41796875]
["North Coast","Oxford. D","Condiments","Louisiana Fiery Hot Pepper Sauce",42342,287.9296875,94.5,2015,12,"Dec","Not YTD","NotPTM","Fri",27209.35546875]
["North Coast","Atterson. P","Beverages","Chang",42343,143.96484375,85.5,2015,12,"Dec","Not YTD","NotPTM","Sat",12308.994140625]
["West Coast","Toonly. S","Confections","Scottish Longbreads",42343,143.96484375,56,2015,12,"Dec","Not YTD","NotPTM","Sat",8062.03125]
["West Coast","Stanly. N","Grains/Cereals","Singaporean Hokkien Fried Mee",42343,7.1982421875,63,2015,12,"Dec","Not YTD","NotPTM","Sat",453.4892578125]
["North Coast","Altercon. C","Produce","Uncle Bob's Organic Dried Pears",42343,126.68906249999999,135,2015,12,"Dec","Not YTD","NotPTM","Sat",17103.0234375]
["South Coast","Moodley. L","Dairy Products","Camembert Pierrot",42346,54.706640624999999,153,2015,12,"Dec","Not YTD","NotPTM","Tue",8370.1160156249989]
["North Coast","Dinnel. M","Grains/Cereals","Filo Mix",42346,54.706640624999999,31.5,2015,12,"Dec","Not YTD","NotPTM","Tue",1723.2591796874999]
["South Coast","Lumford. T","Dairy Products","Fløtemysost",42346,43.189453125,96.5,2015,12,"Dec","Not YTD","NotPTM","Tue",4167.7822265625]
["South Coast","Franly. S","Dairy Products","Gorgonzola Telino",42346,179.9560546875,56,2015,12,"Dec","Not YTD","NotPTM","Tue",10077.5390625]
["North Coast","Connely. K","Grains/Cereals","Gustaf's Knäckebröd",42346,14.396484375,94.5,2015,12,"Dec","Not YTD","NotPTM","Tue",1360.4677734375]
["West Coast","Oddesy. Y","Seafood","Jack's New England Clam Chowder",42346,107.97363281250001,43,2015,12,"Dec","Not YTD","NotPTM","Tue",4642.8662109375009]
["West Coast","Numkin. M","Condiments","Sirop d'érable",42346,71.982421875,128,2015,12,"Dec","Not YTD","NotPTM","Tue",9213.75]
["East Coast","Peters. K","Confections","Tarte au sucre",42346,54.706640624999999,221.5,2015,12,"Dec","Not YTD","NotPTM","Tue",12117.5208984375]
["West Coast","Pursly. U","Dairy Products","Queso Cabrales",42347,54.706640624999999,94.5,2015,12,"Dec","Not YTD","NotPTM","Wed",5169.7775390625002]
["West Coast","Rooney. Y","Dairy Products","Fløtemysost",42348,57.5859375,96.5,2015,12,"Dec","Not YTD","NotPTM","Thu",5557.04296875]
["South Coast","Grooner. T","Dairy Products","Raclette Courdavault",42348,90.697851562499991,247.5,2015,12,"Dec","Not YTD","NotPTM","Thu",22447.718261718746]
["West Coast","Stanly. N","Meat/Poultry","Thüringer Rostbratwurst",42348,64.7841796875,557,2015,12,"Dec","Not YTD","NotPTM","Thu",36084.7880859375]
["East Coast","Bonders. P","Meat/Poultry","Alice Mutton",42349,119.49082031249999,175.5,2015,12,"Dec","Not YTD","NotPTM","Fri",20970.638964843747]
["East Coast","Newson. L","Dairy Products","Gorgonzola Telino",42349,259.13671875,56,2015,12,"Dec","Not YTD","NotPTM","Fri",14511.65625]
["North Coast","Edford. O","Condiments","Louisiana Hot Spiced Okra",42349,179.9560546875,76.5,2015,12,"Dec","Not YTD","NotPTM","Fri",13766.63818359375]
["West Coast","Toonly. S","Beverages","Rhönbräu Klosterbier",42349,25.913671875000002,34.5,2015,12,"Dec","Not YTD","NotPTM","Fri",894.02167968750007]
["West Coast","Numkin. M","Seafood","Ikura",42350,21.5947265625,139.5,2015,12,"Dec","Not YTD","NotPTM","Sat",3012.46435546875]
["East Coast","Lavin. T","Beverages","Laughing Lumberjack Lager",42350,11.5171875,63,2015,12,"Dec","Not YTD","NotPTM","Sat",725.58281250000005]
["East Coast","Perks. M","Dairy Products","Gorgonzola Telino",42353,57.5859375,56,2015,12,"Dec","Not YTD","NotPTM","Tue",3224.8125]
["North Coast","Oxford. D","Produce","Manjimup Dried Apples",42353,431.89453125000006,238.5,2015,12,"Dec","Not YTD","NotPTM","Tue",103006.84570312501]
["South Coast","Hannis. H","Seafood","Røgede sild",42353,97.896093750000006,42.5,2015,12,"Dec","Not YTD","NotPTM","Tue",4160.583984375]
["West Coast","Oddesy. Y","Grains/Cereals","Singaporean Hokkien Fried Mee",42353,115.171875,63,2015,12,"Dec","Not YTD","NotPTM","Tue",7255.828125]
["West Coast","Pursly. U","Seafood","Jack's New England Clam Chowder",42354,35.9912109375,43,2015,12,"Dec","Not YTD","NotPTM","Wed",1547.6220703125]
["East Coast","Anderson. P","Condiments","Original Frankfurter grüne Soße",42354,54.706640624999999,58.5,2015,12,"Dec","Not YTD","NotPTM","Wed",3200.3384765625001]
["West Coast","Rooney. Y","Beverages","Outback Lager",42354,126.68906249999999,67.5,2015,12,"Dec","Not YTD","NotPTM","Wed",8551.51171875]
["East Coast","Johnson. A","Confections","Pavlova",42354,71.982421875,78.5,2015,12,"Dec","Not YTD","NotPTM","Wed",5650.6201171875]
["South Coast","Ilknis. K","Confections","Tarte au sucre",42354,71.982421875,221.5,2015,12,"Dec","Not YTD","NotPTM","Wed",15944.1064453125]
["North Coast","Atterson. P","Grains/Cereals","Gnocchi di nonna Alice",42355,71.982421875,171,2015,12,"Dec","Not YTD","NotPTM","Thu",12308.994140625]
["North Coast","Altercon. C","Dairy Products","Gorgonzola Telino",42355,4.3189453124999995,56,2015,12,"Dec","Not YTD","NotPTM","Thu",241.86093749999998]
["East Coast","Peters. K","Produce","Longlife Tofu",42355,126.68906249999999,45,2015,12,"Dec","Not YTD","NotPTM","Thu",5701.0078125]
["South Coast","Jarison. P","Meat/Poultry","Tourtière",42355,11.5171875,33.5,2015,12,"Dec","Not YTD","NotPTM","Thu",385.82578125000003]
["East Coast","Bonders. P","Beverages","Chartreuse verte",42356,7.1982421875,81,2015,12,"Dec","Not YTD","NotPTM","Fri",583.0576171875]
["East Coast","Newson. L","Beverages","Côte de Blaye",42356,18.715429687499999,1185.5,2015,12,"Dec","Not YTD","NotPTM","Fri",22187.141894531247]
["South Coast","Kinsly. N","Dairy Products","Gorgonzola Telino",42356,35.9912109375,56,2015,12,"Dec","Not YTD","NotPTM","Fri",2015.5078125]
["North Coast","Connely. K","Seafood","Ikura",42356,35.9912109375,139.5,2015,12,"Dec","Not YTD","NotPTM","Fri",5020.77392578125]
["South Coast","Lumford. T","Seafood","Inlagd Sill",42356,107.97363281250001,85.5,2015,12,"Dec","Not YTD","NotPTM","Fri",9231.7456054687518]
["East Coast","Perks. M","Dairy Products","Mozzarella di Giovanni",42356,107.97363281250001,156.5,2015,12,"Dec","Not YTD","NotPTM","Fri",16897.873535156254]
["East Coast","Lavin. T","Beverages","Rhönbräu Klosterbier",42356,35.9912109375,34.5,2015,12,"Dec","Not YTD","NotPTM","Fri",1241.69677734375]
["South Coast","Moodley. L","Beverages","Chang",42357,54.706640624999999,85.5,2015,12,"Dec","Not YTD","NotPTM","Sat",4677.4177734374998]
["North Coast","Dinnel. M","Seafood","Nord-Ost Matjeshering",42357,54.706640624999999,116.5,2015,12,"Dec","Not YTD","NotPTM","Sat",6373.3236328124995]
["North Coast","Edford. O","Condiments","Northwoods Cranberry Sauce",42357,107.97363281250001,180,2015,12,"Dec","Not YTD","NotPTM","Sat",19435.253906250004]
["South Coast","Franly. S","Beverages","Rhönbräu Klosterbier",42357,151.1630859375,34.5,2015,12,"Dec","Not YTD","NotPTM","Sat",5215.12646484375]
["West Coast","Stanly. N","Meat/Poultry","Thüringer Rostbratwurst",42357,71.982421875,557,2015,12,"Dec","Not YTD","NotPTM","Sat",40094.208984375]
["East Coast","Peters. K","Seafood","Carnarvon Tigers",42360,107.97363281250001,281,2015,12,"Dec","Not YTD","NotPTM","Tue",30340.590820312504]
["East Coast","Johnson. A","Grains/Cereals","Gnocchi di nonna Alice",42360,71.982421875,171,2015,12,"Dec","Not YTD","NotPTM","Tue",12308.994140625]
["East Coast","Bonders. P","Beverages","Rhönbräu Klosterbier",42360,143.96484375,34.5,2015,12,"Dec","Not YTD","NotPTM","Tue",4966.787109375]
["East Coast","Anderson. P","Confections","Scottish Longbreads",42360,64.7841796875,56,2015,12,"Dec","Not YTD","NotPTM","Tue",3627.9140625]
["West Coast","Toonly. S","Beverages","Steeleye Stout",42360,54.706640624999999,81,2015,12,"Dec","Not YTD","NotPTM","Tue",4431.2378906249996]
["West Coast","Oddesy. Y","Confections","Teatime Chocolate Biscuits",42360,179.9560546875,41,2015,12,"Dec","Not YTD","NotPTM","Tue",7378.1982421875]
["North Coast","Oxford. D","Produce","Uncle Bob's Organic Dried Pears",42360,11.5171875,135,2015,12,"Dec","Not YTD","NotPTM","Tue",1554.8203125]
["West Coast","Numkin. M","Condiments","Vegie-spread",42360,107.97363281250001,197.5,2015,12,"Dec","Not YTD","NotPTM","Tue",21324.792480468754]
["West Coast","Rooney. Y","Beverages","Chang",42361,35.9912109375,85.5,2015,12,"Dec","Not YTD","NotPTM","Wed",3077.24853515625]
["South Coast","Grooner. T","Seafood","Jack's New England Clam Chowder",42361,71.982421875,43,2015,12,"Dec","Not YTD","NotPTM","Wed",3095.244140625]
["East Coast","Newson. L","Confections","Scottish Longbreads",42361,54.706640624999999,56,2015,12,"Dec","Not YTD","NotPTM","Wed",3063.5718750000001]
["North Coast","Altercon. C","Meat/Poultry","Thüringer Rostbratwurst",42361,50.387695312500007,557,2015,12,"Dec","Not YTD","NotPTM","Wed",28065.946289062504]
["West Coast","Pursly. U","Meat/Poultry","Tourtière",42361,11.5171875,33.5,{"$f":"YEAR(E2052)","v":2015},{"$f":"MONTH(E2052)","v":12},{"$f":"TEXT(E2052,\"mmm\")","v":"Dec"},{"$f":"IF(I2052<MONTH(TODAY()),\"YTD\",\"Not YTD\")","v":"Not YTD"},{"$f":"IF(AND(E2052>=EarliestDate,E2052<=MostRecentDate),\"Past12Months\",\"NotPTM\")","v":"NotPTM"},{"$f":"TEXT(E2052,\"ddd\")","v":"Wed"},{"$f":"F2052*G2052","v":385.82578125000003}]
["South Coast","Ilknis. K","Meat/Poultry","Alice Mutton",42362,126.68906249999999,175.5,2015,12,"Dec","Not YTD","NotPTM","Thu",22233.930468749997]
["West Coast","Stanly. N","Grains/Cereals","Filo Mix",42362,28.79296875,31.5,2015,12,"Dec","Not YTD","NotPTM","Thu",906.978515625]
["West Coast","Toonly. S","Seafood","Jack's New England Clam Chowder",42362,50.387695312500007,43,2015,12,"Dec","Not YTD","NotPTM","Thu",2166.6708984375005]
["West Coast","Numkin. M","Confections","Pavlova",42362,234.66269531250001,78.5,2015,12,"Dec","Not YTD","NotPTM","Thu",18421.021582031251]
["South Coast","Hannis. H","Produce","Tofu",42362,54.706640624999999,104.5,2015,12,"Dec","Not YTD","NotPTM","Thu",5716.8439453125002]
["East Coast","Lavin. T","Meat/Poultry","Tourtière",42362,21.5947265625,33.5,2015,12,"Dec","Not YTD","NotPTM","Thu",723.42333984375]
["West Coast","Oddesy. Y","Dairy Products","Gudbrandsdalsost",42363,86.37890625,162,2015,12,"Dec","Not YTD","NotPTM","Fri",13993.3828125]
["East Coast","Perks. M","Condiments","Gula Malacca",42363,35.9912109375,87.5,2015,12,"Dec","Not YTD","NotPTM","Fri",3149.23095703125]
["North Coast","Connely. K","Confections","Gumbär Gummibärchen",42363,76.301367187499991,140.5,2015,12,"Dec","Not YTD","NotPTM","Fri",10720.342089843749]
["North Coast","Atterson. P","Dairy Products","Queso Cabrales",42363,71.982421875,94.5,2015,12,"Dec","Not YTD","NotPTM","Fri",6802.3388671875]
["North Coast","Dinnel. M","Grains/Cereals","Wimmers gute Semmelknödel",42363,126.68906249999999,149.5,2015,12,"Dec","Not YTD","NotPTM","Fri",18940.014843749999]
["West Coast","Pursly. U","Beverages","Guaraná Fantástica",42364,71.982421875,20,2015,12,"Dec","Not YTD","NotPTM","Sat",1439.6484375]
["East Coast","Johnson. A","Seafood","Konbu",42364,71.982421875,27,2015,12,"Dec","Not YTD","NotPTM","Sat",1943.525390625]
["North Coast","Edford. O","Produce","Manjimup Dried Apples",42364,35.9912109375,238.5,2015,12,"Dec","Not YTD","NotPTM","Sat",8583.90380859375]
["South Coast","Kinsly. N","Dairy Products","Mozzarella di Giovanni",42364,35.9912109375,156.5,2015,12,"Dec","Not YTD","NotPTM","Sat",5632.62451171875]
["East Coast","Peters. K","Dairy Products","Queso Cabrales",42364,179.9560546875,94.5,2015,12,"Dec","Not YTD","NotPTM","Sat",17005.84716796875]
["North Coast","Oxford. D","Dairy Products","Raclette Courdavault",42364,90.697851562499991,247.5,2015,12,"Dec","Not YTD","NotPTM","Sat",22447.718261718746]
["South Coast","Jarison. P","Confections","Tarte au sucre",42364,7.1982421875,221.5,2015,12,"Dec","Not YTD","NotPTM","Sat",1594.41064453125]
["East Coast","Anderson. P","Meat/Poultry","Tourtière",42364,25.913671875000002,33.5,2015,12,"Dec","Not YTD","NotPTM","Sat",868.10800781250009]
["South Coast","Grooner. T","Meat/Poultry","Alice Mutton",42367,143.96484375,175.5,2015,12,"Dec","Not YTD","NotPTM","Tue",25265.830078125]
["South Coast","Franly. S","Produce","Manjimup Dried Apples",42367,107.97363281250001,238.5,2015,12,"Dec","Not YTD","NotPTM","Tue",25751.711425781254]
["West Coast","Rooney. Y","Seafood","Nord-Ost Matjeshering",42367,90.697851562499991,116.5,2015,12,"Dec","Not YTD","NotPTM","Tue",10566.299707031249]
["East Coast","Bonders. P","Meat/Poultry","Pâté chinois",42367,215.94726562500003,108,2015,12,"Dec","Not YTD","NotPTM","Tue",23322.304687500004]
["South Coast","Lumford. T","Confections","Tarte au sucre",42367,18.715429687499999,221.5,2015,12,"Dec","Not YTD","NotPTM","Tue",4145.4676757812495]
["South Coast","Moodley. L","Meat/Poultry","Thüringer Rostbratwurst",42367,71.982421875,557,2015,12,"Dec","Not YTD","NotPTM","Tue",40094.208984375]
["East Coast","Newson. L","Beverages","Côte de Blaye",42368,35.9912109375,1185.5,2015,12,"Dec","Not YTD","NotPTM","Wed",42667.58056640625]
["East Coast","Perks. M","Seafood","Ikura",42368,129.568359375,139.5,2015,12,"Dec","Not YTD","NotPTM","Wed",18074.7861328125]
["West Coast","Stanly. N","Confections","Maxilaku",42368,14.396484375,90,2015,12,"Dec","Not YTD","NotPTM","Wed",1295.68359375]
["North Coast","Altercon. C","Confections","NuNuCa Nuß-Nougat-Creme",42368,54.706640624999999,63,2015,12,"Dec","Not YTD","NotPTM","Wed",3446.5183593749998]
["West Coast","Numkin. M","Dairy Products","Raclette Courdavault",42368,54.706640624999999,247.5,2015,12,"Dec","Not YTD","NotPTM","Wed",13539.8935546875]
["South Coast","Hannis. H","Produce","Rössle Sauerkraut",42368,86.37890625,205,2015,12,"Dec","Not YTD","NotPTM","Wed",17707.67578125]
["West Coast","Toonly. S","Beverages","Sasquatch Ale",42368,35.9912109375,63,2015,12,"Dec","Not YTD","NotPTM","Wed",2267.4462890625]
["East Coast","Lavin. T","Confections","Teatime Chocolate Biscuits",42368,86.37890625,41,2015,12,"Dec","Not YTD","NotPTM","Wed",3541.53515625]
["West Coast","Oddesy. Y","Seafood","Boston Crab Meat",42369,4.3189453124999995,82.5,2015,12,"Dec","Not YTD","NotPTM","Thu",356.31298828124994]
["North Coast","Connely. K","Beverages","Chang",42369,71.982421875,85.5,2015,12,"Dec","Not YTD","NotPTM","Thu",6154.4970703125]
["East Coast","Anderson. P","Produce","Longlife Tofu",42369,54.706640624999999,45,2015,12,"Dec","Not YTD","NotPTM","Thu",2461.798828125]
["North Coast","Atterson. P","Condiments","Louisiana Fiery Hot Pepper Sauce",42369,7.1982421875,94.5,2015,12,"Dec","Not YTD","NotPTM","Thu",680.23388671875]
["South Coast","Hannis. H","Seafood","Ikura",42370,65.407499999999999,87.5,2016,1,"Jan","YTD","NotPTM","Fri",5723.15625]
["West Coast","Stanly. N","Beverages","Ipoh Coffee",42370,163.51874999999998,207,2016,1,"Jan","YTD","NotPTM","Fri",33848.381249999999]
["East Coast","Lavin. T","Confections","Scottish Longbreads",42370,41.424749999999996,56,2016,1,"Jan","YTD","NotPTM","Fri",2319.7859999999996]
["East Coast","Lavin. T","Confections","Scottish Longbreads",42370,27.253125000000001,205,2016,1,"Jan","YTD","NotPTM","Fri",5586.890625]
["East Coast","Newson. L","Confections","Sir Rodney's Marmalade",42370,41.424749999999996,364.5,2016,1,"Jan","YTD","NotPTM","Fri",15099.321374999998]
["South Coast","Lumford. T","Meat/Poultry","Tourtière",42370,41.424749999999996,33.5,2016,1,"Jan","YTD","NotPTM","Fri",1387.7291249999998]
["North Coast","Atterson. P","Confections","Zaanse koeken",42370,41.424749999999996,42.5,2016,1,"Jan","YTD","NotPTM","Fri",1760.5518749999999]
["South Coast","Ilknis. K","Grains/Cereals","Gnocchi di nonna Alice",42371,54.506250000000001,171,2016,1,"Jan","YTD","NotPTM","Sat",9320.5687500000004]
["West Coast","Pursly. U","Dairy Products","Gudbrandsdalsost",42371,81.759374999999991,136.5,2016,1,"Jan","YTD","NotPTM","Sat",11160.154687499999]
["South Coast","Ilknis. K","Confections","NuNuCa Nuß-Nougat-Creme",42371,109.0125,45,2016,1,"Jan","YTD","NotPTM","Sat",4905.5625]
["East Coast","Lavin. T","Condiments","Original Frankfurter grüne Soße",42371,81.759374999999991,58.5,2016,1,"Jan","YTD","NotPTM","Sat",4782.9234374999996]
["East Coast","Peters. K","Grains/Cereals","Tunnbröd",42371,109.0125,50,2016,1,"Jan","YTD","NotPTM","Sat",5450.625]
["North Coast","Edford. O","Meat/Poultry","Alice Mutton",42372,136.265625,81,2016,1,"Jan","YTD","NotPTM","Sun",11037.515625]
["South Coast","Kinsly. N","Beverages","Chai",42372,16.351875,436.5,2016,1,"Jan","YTD","NotPTM","Sun",7137.5934374999997]
["South Coast","Jarison. P","Condiments","Gula Malacca",42372,65.407499999999999,87.5,2016,1,"Jan","YTD","NotPTM","Sun",5723.15625]
["West Coast","Pursly. U","Meat/Poultry","Thüringer Rostbratwurst",42372,109.0125,557,2016,1,"Jan","YTD","NotPTM","Sun",60719.962500000001]
["West Coast","Pursly. U","Grains/Cereals","Tunnbröd",42372,67.58775,58.5,2016,1,"Jan","YTD","NotPTM","Sun",3953.8833749999999]
["North Coast","Altercon. C","Dairy Products","Camembert Pierrot",42373,81.759374999999991,153,2016,1,"Jan","YTD","NotPTM","Mon",12509.184374999999]
["South Coast","Jarison. P","Condiments","Original Frankfurter grüne Soße",42373,21.802500000000002,205,2016,1,"Jan","YTD","NotPTM","Mon",4469.5125000000007]
["South Coast","Lumford. T","Confections","Sir Rodney's Scones",42373,81.759374999999991,45,2016,1,"Jan","YTD","NotPTM","Mon",3679.1718749999995]
["North Coast","Altercon. C","Dairy Products","Fløtemysost",42381,40.334625000000003,149.5,{"$f":"YEAR(E2110)","v":2016},{"$f":"MONTH(E2110)","v":1},{"$f":"TEXT(E2110,\"mmm\")","v":"Jan"},{"$f":"IF(I2110<MONTH(TODAY()),\"YTD\",\"Not YTD\")","v":"YTD"},{"$f":"IF(AND(E2110>=EarliestDate,E2110<=MostRecentDate),\"Past12Months\",\"NotPTM\")","v":"NotPTM"},{"$f":"TEXT(E2110,\"ddd\")","v":"Tue"},6030.0264375000006]
["North Coast","Connely. K","Dairy Products","Gorgonzola Telino",42381,136.265625,82.5,2016,1,"Jan","YTD","NotPTM","Tue",11241.9140625]
["East Coast","Peters. K","Seafood","Nord-Ost Matjeshering",42381,27.253125000000001,116.5,2016,1,"Jan","YTD","NotPTM","Tue",3174.9890625000003]
["West Coast","Stanly. N","Seafood","Röd Kaviar",42381,65.407499999999999,67.5,2016,1,"Jan","YTD","NotPTM","Tue",4415.0062500000004]
["North Coast","Oxford. D","Seafood","Boston Crab Meat",42382,40.334625000000003,45,2016,1,"Jan","YTD","NotPTM","Wed",1815.058125]
["South Coast","Kinsly. N","Dairy Products","Fløtemysost",42382,10.901250000000001,144,2016,1,"Jan","YTD","NotPTM","Wed",1569.7800000000002]
["North Coast","Edford. O","Dairy Products","Raclette Courdavault",42382,114.46312500000001,247.5,2016,1,"Jan","YTD","NotPTM","Wed",{"$f":"F2116*G2116","v":28329.623437500002}]
["West Coast","Pursly. U","Beverages","Rhönbräu Klosterbier",42382,27.253125000000001,27.5,2016,1,"Jan","YTD","NotPTM","Wed",749.4609375]
["East Coast","Newson. L","Seafood","Røgede sild",42382,136.265625,82.5,2016,1,"Jan","YTD","NotPTM","Wed",11241.9140625]
["South Coast","Ilknis. K","Meat/Poultry","Tourtière",42382,41.424749999999996,26.5,2016,1,"Jan","YTD","NotPTM","Wed",1097.7558749999998]
["West Coast","Stanly. N","Beverages","Chang",42383,14.171625000000001,85.5,2016,1,"Jan","YTD","NotPTM","Thu",1211.6739375]
["South Coast","Jarison. P","Dairy Products","Fløtemysost",42383,5.4506250000000005,77,2016,1,"Jan","YTD","NotPTM","Thu",419.69812500000006]
["South Coast","Moodley. L","Dairy Products","Geitost",42383,92.66062500000001,1185.5,2016,1,"Jan","YTD","NotPTM","Thu",109849.17093750001]
["West Coast","Oddesy. Y","Dairy Products","Geitost",42383,98.111249999999998,45,2016,1,"Jan","YTD","NotPTM","Thu",4415.0062500000004]
["West Coast","Toonly. S","Beverages","Lakkalikööri",42383,81.759374999999991,948.5,2016,1,"Jan","YTD","NotPTM","Thu",77548.767187499994]
["East Coast","Lavin. T","Dairy Products","Mozzarella di Giovanni",42383,2.18025,156.5,2016,1,"Jan","YTD","NotPTM","Thu",341.20912500000003]
["East Coast","Perks. M","Dairy Products","Gorgonzola Telino",42384,54.506250000000001,78.5,2016,1,"Jan","YTD","NotPTM","Fri",4278.7406250000004]
["West Coast","Oddesy. Y","Grains/Cereals","Singaporean Hokkien Fried Mee",42384,94.840875000000011,67.5,2016,1,"Jan","YTD","NotPTM","Fri",6401.7590625000012]
["West Coast","Rooney. Y","Dairy Products","Geitost",42385,41.424749999999996,11,2016,1,"Jan","YTD","NotPTM","Sat",455.67224999999996]
["East Coast","Johnson. A","Confections","Maxilaku",42385,16.351875,90,2016,1,"Jan","YTD","NotPTM","Sat",1471.66875]
["South Coast","Franly. S","Grains/Cereals","Ravioli Angelo",42385,109.0125,87.5,2016,1,"Jan","YTD","NotPTM","Sat",9538.59375]
["North Coast","Dinnel. M","Beverages","Rhönbräu Klosterbier",42385,136.265625,67.5,2016,1,"Jan","YTD","NotPTM","Sat",9197.9296875]
["North Coast","Atterson. P","Confections","Sir Rodney's Scones",42385,41.424749999999996,45,2016,1,"Jan","YTD","NotPTM","Sat",1864.1137499999998]
["North Coast","Altercon. C","Seafood","Spegesild",42385,163.51874999999998,54,2016,1,"Jan","YTD","NotPTM","Sat",8830.0124999999989]
["East Coast","Newson. L","Confections","Teatime Chocolate Biscuits",42385,54.506250000000001,32.5,2016,1,"Jan","YTD","NotPTM","Sat",1771.453125]
["West Coast","Oddesy. Y","Grains/Cereals","Gnocchi di nonna Alice",42386,163.51874999999998,171,2016,1,"Jan","YTD","NotPTM","Sun",27961.706249999996]
["East Coast","Perks. M","Seafood","Inlagd Sill",42386,76.308750000000003,238.5,2016,1,"Jan","YTD","NotPTM","Sun",18199.636875]
["North Coast","Atterson. P","Condiments","Louisiana Fiery Hot Pepper Sauce",42386,81.759374999999991,104.5,2016,1,"Jan","YTD","NotPTM","Sun",8543.8546874999993]
["North Coast","Edford. O","Condiments","Northwoods Cranberry Sauce",42386,32.703749999999999,59.5,2016,1,"Jan","YTD","NotPTM","Sun",1945.8731250000001]
["South Coast","Hannis. H","Condiments","Sirop d'érable",42386,21.802500000000002,54,2016,1,"Jan","YTD","NotPTM","Sun",1177.335]
["West Coast","Rooney. Y","Condiments","Chef Anton's Cajun Seasoning",42387,105.742125,364.5,2016,1,"Jan","YTD","NotPTM","Mon",38543.004562499998]
["North Coast","Altercon. C","Grains/Cereals","Gustaf's Knäckebröd",42387,163.51874999999998,171,2016,1,"Jan","YTD","NotPTM","Mon",27961.706249999996]
["North Coast","Connely. K","Beverages","Lakkalikööri",42387,27.253125000000001,81,2016,1,"Jan","YTD","NotPTM","Mon",2207.5031250000002]
["East Coast","Lavin. T","Condiments","Northwoods Cranberry Sauce",42387,27.253125000000001,180,2016,1,"Jan","YTD","NotPTM","Mon",4905.5625]
["North Coast","Connely. K","Beverages","Rhönbräu Klosterbier",42387,98.111249999999998,34.5,2016,1,"Jan","YTD","NotPTM","Mon",3384.8381249999998]
["West Coast","Stanly. N","Dairy Products","Mozzarella di Giovanni",42389,163.51874999999998,156.5,{"$f":"YEAR(E2145)","v":2016},{"$f":"MONTH(E2145)","v":1},{"$f":"TEXT(E2145,\"mmm\")","v":"Jan"},{"$f":"IF(I2145<MONTH(TODAY()),\"YTD\",\"Not YTD\")","v":"YTD"},{"$f":"IF(AND(E2145>=EarliestDate,E2145<=MostRecentDate),\"Past12Months\",\"NotPTM\")","v":"NotPTM"},{"$f":"TEXT(E2145,\"ddd\")","v":"Wed"},25590.684374999997]
["South Coast","Hannis. H","Confections","Zaanse koeken",42389,81.759374999999991,34,2016,1,"Jan","YTD","NotPTM","Wed",2779.8187499999999]
["West Coast","Toonly. S","Seafood","Jack's New England Clam Chowder",42390,49.055624999999999,171,2016,1,"Jan","YTD","NotPTM","Thu",8388.5118750000001]
["South Coast","Ilknis. K","Grains/Cereals","Tunnbröd",42390,163.51874999999998,85.5,2016,1,"Jan","YTD","NotPTM","Thu",13980.853124999998]
["North Coast","Altercon. C","Seafood","Escargots de Bourgogne",42391,32.703749999999999,59.5,2016,1,"Jan","YTD","NotPTM","Fri",1945.8731250000001]
["South Coast","Ilknis. K","Condiments","Gula Malacca",42391,57.776625000000003,87.5,2016,1,"Jan","YTD","NotPTM","Fri",5055.4546875000005]
["West Coast","Toonly. S","Confections","Sir Rodney's Marmalade",42391,43.605000000000004,436.5,2016,1,"Jan","YTD","NotPTM","Fri",19033.5825]
["North Coast","Edford. O","Condiments","Sirop d'érable",42391,41.424749999999996,128,2016,1,"Jan","YTD","NotPTM","Fri",5302.3679999999995]
["West Coast","Toonly. S","Beverages","Steeleye Stout",42391,136.265625,41,2016,1,"Jan","YTD","NotPTM","Fri",5586.890625]
["South Coast","Kinsly. N","Seafood","Jack's New England Clam Chowder",42392,81.759374999999991,11,2016,1,"Jan","YTD","NotPTM","Sat",899.35312499999986]
["South Coast","Jarison. P","Beverages","Rhönbräu Klosterbier",42392,54.506250000000001,34.5,2016,1,"Jan","YTD","NotPTM","Sat",1880.465625]
["East Coast","Peters. K","Confections","Tarte au sucre",42392,81.759374999999991,34.5,2016,1,"Jan","YTD","NotPTM","Sat",2820.6984374999997]
["South Coast","Jarison. P","Seafood","Boston Crab Meat",42393,43.605000000000004,36,2016,1,"Jan","YTD","NotPTM","Sun",1569.7800000000002]
["East Coast","Bonders. P","Seafood","Ikura",42393,27.253125000000001,139.5,2016,1,"Jan","YTD","NotPTM","Sun",3801.8109374999999]
["North Coast","Dinnel. M","Beverages","Lakkalikööri",42393,54.506250000000001,64.5,2016,1,"Jan","YTD","NotPTM","Sun",3515.6531250000003]
["North Coast","Connely. K","Dairy Products","Raclette Courdavault",42393,10.901250000000001,247.5,2016,1,"Jan","YTD","NotPTM","Sun",2698.0593750000003]
["West Coast","Pursly. U","Seafood","Röd Kaviar",42393,41.424749999999996,67.5,2016,1,"Jan","YTD","NotPTM","Sun",2796.1706249999997]
["East Coast","Lavin. T","Grains/Cereals","Singaporean Hokkien Fried Mee",42393,23.982749999999999,31.5,2016,1,"Jan","YTD","NotPTM","Sun",755.45662500000003]
["North Coast","Altercon. C","Confections","Sir Rodney's Scones",42393,38.154375000000002,36,2016,1,"Jan","YTD","NotPTM","Sun",1373.5575000000001]
["East Coast","Anderson. P","Meat/Poultry","Tourtière",42393,41.424749999999996,33.5,2016,1,"Jan","YTD","NotPTM","Sun",1387.7291249999998]
["East Coast","Perks. M","Condiments","Aniseed Syrup",42394,13.081499999999998,32.5,2016,1,"Jan","YTD","NotPTM","Mon",425.14874999999995]
["South Coast","Kinsly. N","Beverages","Chang",42394,38.154375000000002,171,2016,1,"Jan","YTD","NotPTM","Mon",6524.3981250000006]
["West Coast","Stanly. N","Beverages","Chang",42394,65.407499999999999,26.5,2016,1,"Jan","YTD","NotPTM","Mon",1733.2987499999999]
["East Coast","Newson. L","Beverages","Guaraná Fantástica",42394,109.0125,171,2016,1,"Jan","YTD","NotPTM","Mon",18641.137500000001]
["North Coast","Altercon. C","Beverages","Ipoh Coffee",42394,54.506250000000001,207,2016,1,"Jan","YTD","NotPTM","Mon",11282.793750000001]
["South Coast","Kinsly. N","Seafood","Røgede sild",42394,81.759374999999991,42.5,2016,1,"Jan","YTD","NotPTM","Mon",3474.7734374999995]
["West Coast","Toonly. S","Produce","Rössle Sauerkraut",42394,41.424749999999996,205,2016,1,"Jan","YTD","NotPTM","Mon",8492.0737499999996]
["North Coast","Dinnel. M","Grains/Cereals","Wimmers gute Semmelknödel",42394,67.58775,247.5,2016,1,"Jan","YTD","NotPTM","Mon",16727.968124999999]
["North Coast","Edford. O","Produce","Manjimup Dried Apples",42395,27.253125000000001,238.5,2016,1,"Jan","YTD","NotPTM","Tue",6499.8703125000002]
["South Coast","Lumford. T","Confections","Tarte au sucre",42398,81.759374999999991,238.5,2016,1,"Jan","YTD","NotPTM","Fri",19499.610937499998]
["South Coast","Moodley. L","Meat/Poultry","Thüringer Rostbratwurst",42398,109.0125,175.5,2016,1,"Jan","YTD","NotPTM","Fri",19131.693750000002]
["East Coast","Lavin. T","Grains/Cereals","Gnocchi di nonna Alice",42399,32.703749999999999,75.5,2016,1,"Jan","YTD","NotPTM","Sat",2469.1331249999998]
["East Coast","Perks. M","Seafood","Ikura",42399,98.111249999999998,139.5,2016,1,"Jan","YTD","NotPTM","Sat",13686.519375]
["East Coast","Anderson. P","Confections","Schoggi Schokolade",42401,115.625,197.5,{"$f":"YEAR(E2178)","v":2016},{"$f":"MONTH(E2178)","v":2},{"$f":"TEXT(E2178,\"mmm\")","v":"Feb"},{"$f":"IF(I2178<MONTH(TODAY()),\"YTD\",\"Not YTD\")","v":"YTD"},{"$f":"IF(AND(E2178>=EarliestDate,E2178<=MostRecentDate),\"Past12Months\",\"NotPTM\")","v":"NotPTM"},{"$f":"TEXT(E2178,\"ddd\")","v":"Mon"},22835.9375]
["North Coast","Oxford. D","Grains/Cereals","Singaporean Hokkien Fried Mee",42401,28.90625,61,2016,2,"Feb","YTD","NotPTM","Mon",1763.28125]
["West Coast","Numkin. M","Meat/Poultry","Thüringer Rostbratwurst",42401,86.71875,36,2016,2,"Feb","YTD","NotPTM","Mon",{"$f":"F2180*G2180","v":3121.875}]
["South Coast","Grooner. T","Dairy Products","Camembert Pierrot",42402,57.8125,153,2016,2,"Feb","YTD","NotPTM","Tue",8845.3125]
["West Coast","Rooney. Y","Condiments","Louisiana Fiery Hot Pepper Sauce",42402,43.9375,75.5,2016,2,"Feb","YTD","NotPTM","Tue",3317.28125]
["West Coast","Pursly. U","Produce","Manjimup Dried Apples",42402,5.78125,63,2016,2,"Feb","YTD","NotPTM","Tue",364.21875]
["South Coast","Hannis. H","Condiments","Vegie-spread",42402,188.46875,157.5,2016,2,"Feb","YTD","NotPTM","Tue",29683.828125]
["East Coast","Johnson. A","Beverages","Chartreuse verte",42403,94.8125,175.5,2016,2,"Feb","YTD","NotPTM","Wed",16639.59375]
["North Coast","Dinnel. M","Grains/Cereals","Gustaf's Knäckebröd",42403,17.34375,94.5,2016,2,"Feb","YTD","NotPTM","Wed",1638.984375]
["North Coast","Atterson. P","Beverages","Ipoh Coffee",42403,115.625,207,2016,2,"Feb","YTD","NotPTM","Wed",23934.375]
["North Coast","Edford. O","Seafood","Jack's New England Clam Chowder",42403,57.8125,43,2016,2,"Feb","YTD","NotPTM","Wed",2485.9375]
["West Coast","Toonly. S","Seafood","Jack's New England Clam Chowder",42403,57.8125,34.5,2016,2,"Feb","YTD","NotPTM","Wed",1994.53125]
["West Coast","Oddesy. Y","Seafood","Konbu",42403,57.8125,66,2016,2,"Feb","YTD","NotPTM","Wed",3815.625]
["West Coast","Rooney. Y","Beverages","Lakkalikööri",42403,52.03125,64.5,2016,2,"Feb","YTD","NotPTM","Wed",3356.015625]
["South Coast","Kinsly. N","Confections","Sir Rodney's Scones",42403,115.625,45,2016,2,"Feb","YTD","NotPTM","Wed",5203.125]
["North Coast","Oxford. D","Dairy Products","Camembert Pierrot",42404,71.6875,16,2016,2,"Feb","YTD","NotPTM","Thu",1147]
["North Coast","Connely. K","Beverages","Chang",42404,42.78125,70,2016,2,"Feb","YTD","NotPTM","Thu",2994.6875]
["East Coast","Peters. K","Condiments","Chef Anton's Cajun Seasoning",42404,86.71875,136.5,2016,2,"Feb","YTD","NotPTM","Thu",11837.109375]
["South Coast","Jarison. P","Condiments","Genen Shouyu",42404,144.53125,69.5,2016,2,"Feb","YTD","NotPTM","Thu",10044.921875]
["South Coast","Ilknis. K","Grains/Cereals","Gustaf's Knäckebröd",42404,115.625,94.5,2016,2,"Feb","YTD","NotPTM","Thu",10926.5625]
["East Coast","Anderson. P","Grains/Cereals","Gustaf's Knäckebröd",42404,57.8125,50,2016,2,"Feb","YTD","NotPTM","Thu",2890.625]
["East Coast","Johnson. A","Beverages","Ipoh Coffee",42404,9.25,165.5,2016,2,"Feb","YTD","NotPTM","Thu",1530.875]
["North Coast","Oxford. D","Condiments","Louisiana Fiery Hot Pepper Sauce",42404,115.625,85.5,2016,2,"Feb","YTD","NotPTM","Thu",9885.9375]
["West Coast","Rooney. Y","Seafood","Spegesild",42404,115.625,67.5,2016,2,"Feb","YTD","NotPTM","Thu",7804.6875]
["South Coast","Ilknis. K","Beverages","Steeleye Stout",42404,69.375,31.5,2016,2,"Feb","YTD","NotPTM","Thu",2185.3125]
["North Coast","Connely. K","Dairy Products","Camembert Pierrot",42405,159.5625,153,2016,2,"Feb","YTD","NotPTM","Fri",24413.0625]
["West Coast","Toonly. S","Beverages","Chai",42405,23.125,81,2016,2,"Feb","YTD","NotPTM","Fri",1873.125]
["East Coast","Bonders. P","Seafood","Jack's New England Clam Chowder",42405,71.6875,20,2016,2,"Feb","YTD","NotPTM","Fri",1433.75]
["North Coast","Connely. K","Grains/Cereals","Tunnbröd",42405,28.90625,40.5,2016,2,"Feb","YTD","NotPTM","Fri",1170.703125]
["North Coast","Connely. K","Grains/Cereals","Tunnbröd",42405,42.78125,41,2016,2,"Feb","YTD","NotPTM","Fri",1754.03125]
["North Coast","Dinnel. M","Beverages","Chang",42406,86.71875,81,2016,2,"Feb","YTD","NotPTM","Sat",7024.21875]
["North Coast","Atterson. P","Produce","Manjimup Dried Apples",42406,71.6875,31.5,2016,2,"Feb","YTD","NotPTM","Sat",2258.15625]
["East Coast","Johnson. A","Dairy Products","Gudbrandsdalsost",42407,69.375,64.5,2016,2,"Feb","YTD","NotPTM","Sun",4474.6875]
["North Coast","Altercon. C","Produce","Longlife Tofu",42407,86.71875,36,2016,2,"Feb","YTD","NotPTM","Sun",3121.875]
["South Coast","Franly. S","Seafood","Nord-Ost Matjeshering",42407,8.09375,78.5,2016,2,"Feb","YTD","NotPTM","Sun",635.359375]
["North Coast","Edford. O","Confections","Teatime Chocolate Biscuits",42407,8.09375,104.5,2016,2,"Feb","YTD","NotPTM","Sun",845.796875]
["South Coast","Grooner. T","Produce","Tofu",42407,34.6875,147.5,2016,2,"Feb","YTD","NotPTM","Sun",5116.40625]
["East Coast","Lavin. T","Confections","Gumbär Gummibärchen",42408,15.03125,140.5,2016,2,"Feb","YTD","NotPTM","Mon",2111.890625]
["East Coast","Lavin. T","Confections","Gumbär Gummibärchen",42408,346.875,128,2016,2,"Feb","YTD","NotPTM","Mon",44400]
["East Coast","Anderson. P","Confections","Sir Rodney's Marmalade",42408,28.90625,56,2016,2,"Feb","YTD","NotPTM","Mon",1618.75]
["East Coast","Newson. L","Dairy Products","Geitost",42409,57.8125,11,2016,2,"Feb","YTD","NotPTM","Tue",635.9375]
["North Coast","Atterson. P","Beverages","Lakkalikööri",42409,69.375,197.5,2016,2,"Feb","YTD","NotPTM","Tue",13701.5625]
["South Coast","Jarison. P","Condiments","Louisiana Hot Spiced Okra",42409,69.375,76.5,2016,2,"Feb","YTD","NotPTM","Tue",5307.1875]
["West Coast","Stanly. N","Confections","Sir Rodney's Marmalade",42409,61.28125,364.5,2016,2,"Feb","YTD","NotPTM","Tue",22337.015625]
["South Coast","Jarison. P","Dairy Products","Fløtemysost",42410,173.4375,96.5,2016,2,"Feb","YTD","NotPTM","Wed",16736.71875]
["West Coast","Toonly. S","Dairy Products","Gorgonzola Telino",42410,17.34375,56,2016,2,"Feb","YTD","NotPTM","Wed",971.25]
["North Coast","Connely. K","Dairy Products","Gudbrandsdalsost",42410,188.46875,162,2016,2,"Feb","YTD","NotPTM","Wed",30531.9375]
["South Coast","Franly. S","Condiments","Louisiana Fiery Hot Pepper Sauce",42410,43.9375,94.5,2016,2,"Feb","YTD","NotPTM","Wed",4152.09375]
["West Coast","Rooney. Y","Seafood","Røgede sild",42410,202.34375,104.5,2016,2,"Feb","YTD","NotPTM","Wed",21144.921875]
["North Coast","Oxford. D","Condiments","Sirop d'érable",42410,17.34375,85.5,2016,2,"Feb","YTD","NotPTM","Wed",1482.890625]
["North Coast","Atterson. P","Meat/Poultry","Thüringer Rostbratwurst",42410,69.375,445.5,2016,2,"Feb","YTD","NotPTM","Wed",30906.5625]
["East Coast","Newson. L","Dairy Products","Gorgonzola Telino",42411,208.125,56,2016,2,"Feb","YTD","NotPTM","Thu",11655]
["South Coast","Hannis. H","Beverages","Lakkalikööri",42411,11.5625,108,2016,2,"Feb","YTD","NotPTM","Thu",1248.75]
["East Coast","Anderson. P","Condiments","Louisiana Hot Spiced Okra",42411,173.4375,61,2016,2,"Feb","YTD","NotPTM","Thu",10579.6875]
["South Coast","Ilknis. K","Meat/Poultry","Perth Pasties",42411,34.6875,147.5,2016,2,"Feb","YTD","NotPTM","Thu",5116.40625]
["West Coast","Oddesy. Y","Dairy Products","Queso Cabrales",42411,100.59375,75.5,2016,2,"Feb","YTD","NotPTM","Thu",7594.828125]
["North Coast","Oxford. D","Confections","Sir Rodney's Scones",42411,34.6875,45,2016,2,"Feb","YTD","NotPTM","Thu",1560.9375]
["South Coast","Franly. S","Meat/Poultry","Tourtière",42411,34.6875,163.5,2016,2,"Feb","YTD","NotPTM","Thu",5671.40625]
["West Coast","Numkin. M","Seafood","Ikura",42412,17.34375,139.5,2016,2,"Feb","YTD","NotPTM","Fri",2419.453125]
["North Coast","Connely. K","Dairy Products","Mozzarella di Giovanni",42412,13.875,87.5,{"$f":"YEAR(E2237)","v":2016},{"$f":"MONTH(E2237)","v":2},{"$f":"TEXT(E2237,\"mmm\")","v":"Feb"},{"$f":"IF(I2237<MONTH(TODAY()),\"YTD\",\"Not YTD\")","v":"YTD"},{"$f":"IF(AND(E2237>=EarliestDate,E2237<=MostRecentDate),\"Past12Months\",\"NotPTM\")","v":"NotPTM"},{"$f":"TEXT(E2237,\"ddd\")","v":"Fri"},1214.0625]
["North Coast","Connely. K","Beverages","Lakkalikööri",42413,37,27,2016,2,"Feb","YTD","NotPTM","Sat",999]
["North Coast","Oxford. D","Beverages","Lakkalikööri",42413,57.8125,56,2016,2,"Feb","YTD","NotPTM","Sat",3237.5]
["East Coast","Bonders. P","Dairy Products","Raclette Courdavault",42413,60.125,156.5,2016,2,"Feb","YTD","NotPTM","Sat",9409.5625]
["East Coast","Newson. L","Seafood","Escargots de Bourgogne",42414,57.8125,59.5,2016,2,"Feb","YTD","NotPTM","Sun",3439.84375]
["West Coast","Pursly. U","Dairy Products","Gorgonzola Telino",42414,9.25,45,2016,2,"Feb","YTD","NotPTM","Sun",416.25]
["South Coast","Franly. S","Meat/Poultry","Alice Mutton",42415,46.25,102.5,2016,2,"Feb","YTD","NotPTM","Mon",4740.625]
["North Coast","Oxford. D","Condiments","Chef Anton's Cajun Seasoning",42418,71.6875,99,2016,2,"Feb","YTD","NotPTM","Thu",{"$f":"F2244*G2244","v":7097.0625}]
["South Coast","Hannis. H","Condiments","Chef Anton's Gumbo Mix",42418,42.78125,81,2016,2,"Feb","YTD","NotPTM","Thu",3465.28125]
["West Coast","Toonly. S","Grains/Cereals","Filo Mix",42418,158.40625,46.5,2016,2,"Feb","YTD","NotPTM","Thu",7365.890625]
["East Coast","Newson. L","Confections","Tarte au sucre",42418,101.75,177,2016,2,"Feb","YTD","NotPTM","Thu",18009.75]
["East Coast","Newson. L","Confections","Tarte au sucre",42418,57.8125,111.5,2016,2,"Feb","YTD","NotPTM","Thu",6446.09375]
["South Coast","Franly. S","Grains/Cereals","Tunnbröd",42418,5.78125,139.5,2016,2,"Feb","YTD","NotPTM","Thu",806.484375]
["East Coast","Newson. L","Condiments","Aniseed Syrup",42419,69.375,33.5,2016,2,"Feb","YTD","NotPTM","Fri",2324.0625]
["West Coast","Oddesy. Y","Beverages","Côte de Blaye",42419,86.71875,948.5,2016,2,"Feb","YTD","NotPTM","Fri",82252.734375]
["West Coast","Oddesy. Y","Beverages","Côte de Blaye",42419,34.6875,198,2016,2,"Feb","YTD","NotPTM","Fri",6868.125]
["East Coast","Peters. K","Dairy Products","Fløtemysost",42419,173.4375,45,2016,2,"Feb","YTD","NotPTM","Fri",7804.6875]
["South Coast","Grooner. T","Dairy Products","Gorgonzola Telino",42419,23.125,56,2016,2,"Feb","YTD","NotPTM","Fri",1295]
["West Coast","Toonly. S","Confections","Gumbär Gummibärchen",42419,86.71875,81,2016,2,"Feb","YTD","NotPTM","Fri",7024.21875]
["North Coast","Dinnel. M","Seafood","Nord-Ost Matjeshering",42419,43.9375,116.5,2016,2,"Feb","YTD","NotPTM","Fri",5118.71875]
["South Coast","Franly. S","Meat/Poultry","Perth Pasties",42419,72.84375,147.5,2016,2,"Feb","YTD","NotPTM","Fri",10744.453125]
["West Coast","Oddesy. Y","Dairy Products","Queso Cabrales",42419,57.8125,42.5,2016,2,"Feb","YTD","NotPTM","Fri",2457.03125]
["West Coast","Pursly. U","Dairy Products","Raclette Courdavault",42419,57.8125,68,2016,2,"Feb","YTD","NotPTM","Fri",3931.25]
["West Coast","Stanly. N","Meat/Poultry","Thüringer Rostbratwurst",42419,57.8125,557,2016,2,"Feb","YTD","NotPTM","Fri",32201.5625]
["East Coast","Lavin. T","Meat/Poultry","Tourtière",42419,17.34375,26.5,2016,2,"Feb","YTD","NotPTM","Fri",459.609375]
["East Coast","Johnson. A","Dairy Products","Raclette Courdavault",42420,17.34375,247.5,2016,2,"Feb","YTD","NotPTM","Sat",4292.578125]
["South Coast","Grooner. T","Confections","Teatime Chocolate Biscuits",42420,15.03125,41,2016,2,"Feb","YTD","NotPTM","Sat",616.28125]
["West Coast","Stanly. N","Dairy Products","Fløtemysost",42421,28.90625,221.5,2016,2,"Feb","YTD","NotPTM","Sun",6402.734375]
["South Coast","Hannis. H","Confections","Teatime Chocolate Biscuits",42421,34.6875,41,2016,2,"Feb","YTD","NotPTM","Sun",1422.1875]
["East Coast","Anderson. P","Seafood","Boston Crab Meat",42422,8.09375,81,2016,2,"Feb","YTD","NotPTM","Mon",655.59375]
["North Coast","Atterson. P","Beverages","Chang",42422,86.71875,85.5,2016,2,"Feb","YTD","NotPTM","Mon",7414.453125]
["North Coast","Dinnel. M","Condiments","Chef Anton's Cajun Seasoning",42422,52.03125,90,2016,2,"Feb","YTD","NotPTM","Mon",4682.8125]
["West Coast","Oddesy. Y","Grains/Cereals","Gnocchi di nonna Alice",42422,144.53125,42.5,2016,2,"Feb","YTD","NotPTM","Mon",6142.578125]
["West Coast","Numkin. M","Confections","Sir Rodney's Scones",42422,115.625,45,2016,2,"Feb","YTD","NotPTM","Mon",5203.125]
["West Coast","Numkin. M","Confections","Sir Rodney's Scones",42422,144.53125,78.5,2016,2,"Feb","YTD","NotPTM","Mon",11345.703125]
["West Coast","Oddesy. Y","Confections","Teatime Chocolate Biscuits",42422,144.53125,41,2016,2,"Feb","YTD","NotPTM","Mon",5925.78125]
["West Coast","Numkin. M","Condiments","Vegie-spread",42422,86.71875,197.5,2016,2,"Feb","YTD","NotPTM","Mon",17126.953125]
["West Coast","Rooney. Y","Confections","Zaanse koeken",42422,34.6875,281,2016,2,"Feb","YTD","NotPTM","Mon",9747.1875]
["South Coast","Kinsly. N","Seafood","Jack's New England Clam Chowder",42423,346.875,43,2016,2,"Feb","YTD","NotPTM","Tue",14915.625]
["South Coast","Jarison. P","Dairy Products","Mascarpone Fabioli",42423,69.375,144,2016,2,"Feb","YTD","NotPTM","Tue",9990]
["North Coast","Connely. K","Confections","Scottish Longbreads",42423,86.71875,45,2016,2,"Feb","YTD","NotPTM","Tue",3902.34375]
["East Coast","Peters. K","Confections","Tarte au sucre",42423,115.625,221.5,2016,2,"Feb","YTD","NotPTM","Tue",25610.9375]
["North Coast","Altercon. C","Meat/Poultry","Thüringer Rostbratwurst",42423,60.125,140.5,2016,2,"Feb","YTD","NotPTM","Tue",8447.5625]
["West Coast","Stanly. N","Grains/Cereals","Filo Mix",42424,23.125,31.5,2016,2,"Feb","YTD","NotPTM","Wed",728.4375]
["West Coast","Numkin. M","Seafood","Jack's New England Clam Chowder",42424,231.25,43,2016,2,"Feb","YTD","NotPTM","Wed",9943.75]
["West Coast","Toonly. S","Seafood","Jack's New England Clam Chowder",42424,69.375,162,2016,2,"Feb","YTD","NotPTM","Wed",11238.75]
["North Coast","Dinnel. M","Beverages","Lakkalikööri",42424,144.53125,66,2016,2,"Feb","YTD","NotPTM","Wed",9539.0625]
["West Coast","Oddesy. Y","Confections","Pavlova",42424,57.8125,82.5,{"$f":"YEAR(E2284)","v":2016},{"$f":"MONTH(E2284)","v":2},{"$f":"TEXT(E2284,\"mmm\")","v":"Feb"},{"$f":"IF(I2284<MONTH(TODAY()),\"YTD\",\"Not YTD\")","v":"YTD"},{"$f":"IF(AND(E2284>=EarliestDate,E2284<=MostRecentDate),\"Past12Months\",\"NotPTM\")","v":"NotPTM"},{"$f":"TEXT(E2284,\"ddd\")","v":"Wed"},4769.53125]
["West Coast","Numkin. M","Confections","Pavlova",42424,57.8125,20,2016,2,"Feb","YTD","NotPTM","Wed",1156.25]
["East Coast","Lavin. T","Meat/Poultry","Tourtière",42424,19.65625,33.5,2016,2,"Feb","YTD","NotPTM","Wed",658.484375]
["South Coast","Jarison. P","Confections","Valkoinen suklaa",42424,40.46875,87.5,2016,2,"Feb","YTD","NotPTM","Wed",3541.015625]
["South Coast","Lumford. T","Condiments","Genen Shouyu",42425,42.78125,104.5,2016,2,"Feb","YTD","NotPTM","Thu",4470.640625]
["North Coast","Altercon. C","Beverages","Ipoh Coffee",42425,42.78125,20,2016,2,"Feb","YTD","NotPTM","Thu",855.625]
["North Coast","Atterson. P","Condiments","Louisiana Hot Spiced Okra",42425,11.5625,76.5,2016,2,"Feb","YTD","NotPTM","Thu",884.53125]
["North Coast","Atterson. P","Dairy Products","Queso Cabrales",42425,57.8125,94.5,2016,2,"Feb","YTD","NotPTM","Thu",5463.28125]
["North Coast","Oxford. D","Beverages","Rhönbräu Klosterbier",42425,61.28125,34.5,2016,2,"Feb","YTD","NotPTM","Thu",2114.203125]
["North Coast","Connely. K","Confections","Sir Rodney's Scones",42425,60.125,45,2016,2,"Feb","YTD","NotPTM","Thu",2705.625]
["North Coast","Edford. O","Dairy Products","Geitost",42439,169.43249999999998,9,{"$f":"YEAR(E2294)","v":2016},{"$f":"MONTH(E2294)","v":3},{"$f":"TEXT(E2294,\"mmm\")","v":"Mar"},{"$f":"IF(I2294<MONTH(TODAY()),\"YTD\",\"Not YTD\")","v":"YTD"},{"$f":"IF(AND(E2294>=EarliestDate,E2294<=MostRecentDate),\"Past12Months\",\"NotPTM\")","v":"NotPTM"},{"$f":"TEXT(E2294,\"ddd\")","v":"Thu"},1524.8924999999997]
["South Coast","Moodley. L","Condiments","Gula Malacca",42439,137.75,69.5,2016,3,"Mar","YTD","NotPTM","Thu",9573.625]
["North Coast","Oxford. D","Condiments","Gula Malacca",42439,103.3125,108,2016,3,"Mar","YTD","NotPTM","Thu",11157.75]
["West Coast","Toonly. S","Seafood","Jack's New England Clam Chowder",42439,86.782499999999985,34.5,2016,3,"Mar","YTD","NotPTM","Thu",2993.9962499999997]
["East Coast","Bonders. P","Produce","Manjimup Dried Apples",42439,68.875,238.5,2016,3,"Mar","YTD","NotPTM","Thu",16426.6875]
["North Coast","Altercon. C","Confections","Pavlova",42439,121.21999999999998,62.5,2016,3,"Mar","YTD","NotPTM","Thu",7576.2499999999991]
["North Coast","Dinnel. M","Dairy Products","Raclette Courdavault",42439,86.782499999999985,198,2016,3,"Mar","YTD","NotPTM","Thu",17182.934999999998]
["East Coast","Perks. M","Condiments","Sirop d'érable",42439,34.4375,140,2016,3,"Mar","YTD","NotPTM","Thu",4821.25]
["South Coast","Lumford. T","Beverages","Steeleye Stout",42439,103.3125,81,2016,3,"Mar","YTD","NotPTM","Thu",8368.3125]
["East Coast","Bonders. P","Dairy Products","Fløtemysost",42440,68.875,96.5,2016,3,"Mar","YTD","NotPTM","Fri",6646.4375]
["North Coast","Edford. O","Condiments","Louisiana Hot Spiced Okra",42440,2.7549999999999999,56,2016,3,"Mar","YTD","NotPTM","Fri",154.28]
["South Coast","Ilknis. K","Produce","Manjimup Dried Apples",42440,68.875,238.5,2016,3,"Mar","YTD","NotPTM","Fri",16426.6875]
["West Coast","Stanly. N","Beverages","Rhönbräu Klosterbier",42440,119.84249999999999,156.5,2016,3,"Mar","YTD","NotPTM","Fri",18755.35125]
["South Coast","Franly. S","Meat/Poultry","Tourtière",42440,275.5,26.5,2016,3,"Mar","YTD","NotPTM","Fri",7300.75]
["West Coast","Oddesy. Y","Grains/Cereals","Tunnbröd",42440,52.344999999999999,32,2016,3,"Mar","YTD","NotPTM","Fri",{"$f":"F2308*G2308","v":1675.04}]
["North Coast","Atterson. P","Produce","Uncle Bob's Organic Dried Pears",42440,275.5,16,2016,3,"Mar","YTD","NotPTM","Fri",4408]
["North Coast","Dinnel. M","Condiments","Vegie-spread",42440,30.304999999999996,96.5,2016,3,"Mar","YTD","NotPTM","Fri",2924.4324999999994]
["South Coast","Ilknis. K","Grains/Cereals","Filo Mix",42441,96.424999999999997,54,2016,3,"Mar","YTD","NotPTM","Sat",5206.95]
["North Coast","Dinnel. M","Beverages","Guaraná Fantástica",42441,275.5,16,2016,3,"Mar","YTD","NotPTM","Sat",4408]
["North Coast","Atterson. P","Meat/Poultry","Thüringer Rostbratwurst",42441,85.404999999999987,34.5,2016,3,"Mar","YTD","NotPTM","Sat",2946.4724999999994]
["West Coast","Rooney. Y","Meat/Poultry","Tourtière",42441,172.1875,94.5,2016,3,"Mar","YTD","NotPTM","Sat",16271.71875]
["West Coast","Pursly. U","Beverages","Rhönbräu Klosterbier",42442,119.84249999999999,45,2016,3,"Mar","YTD","NotPTM","Sun",5392.9124999999995]
["North Coast","Altercon. C","Confections","Chocolade",42443,71.63,108,2016,3,"Mar","YTD","NotPTM","Mon",7736.0399999999991]
["North Coast","Edford. O","Grains/Cereals","Filo Mix",42443,52.344999999999999,25,2016,3,"Mar","YTD","NotPTM","Mon",1308.625]
["East Coast","Perks. M","Dairy Products","Gorgonzola Telino",42443,20.662499999999998,90,2016,3,"Mar","YTD","NotPTM","Mon",1859.6249999999998]
["North Coast","Oxford. D","Condiments","Louisiana Hot Spiced Okra",42443,71.63,36,2016,3,"Mar","YTD","NotPTM","Mon",2578.6799999999998]
["North Coast","Atterson. P","Confections","Tarte au sucre",42443,34.4375,117.5,2016,3,"Mar","YTD","NotPTM","Mon",4046.40625]
["West Coast","Numkin. M","Seafood","Carnarvon Tigers",42444,85.404999999999987,73,2016,3,"Mar","YTD","NotPTM","Tue",6234.5649999999987]
["South Coast","Franly. S","Dairy Products","Queso Manchego La Pastora",42444,50.967499999999994,96,2016,3,"Mar","YTD","NotPTM","Tue",4892.8799999999992]
["West Coast","Stanly. N","Beverages","Rhönbräu Klosterbier",42444,172.1875,281,2016,3,"Mar","YTD","NotPTM","Tue",48384.6875]
["West Coast","Rooney. Y","Beverages","Ipoh Coffee",42445,144.63749999999999,43,2016,3,"Mar","YTD","NotPTM","Wed",6219.4124999999995]
["South Coast","Lumford. T","Beverages","Laughing Lumberjack Lager",42445,16.529999999999998,40.5,2016,3,"Mar","YTD","NotPTM","Wed",669.46499999999992]
["East Coast","Lavin. T","Condiments","Original Frankfurter grüne Soße",42445,121.21999999999998,46.5,2016,3,"Mar","YTD","NotPTM","Wed",5636.73]
["East Coast","Peters. K","Dairy Products","Raclette Courdavault",42445,121.21999999999998,247.5,2016,3,"Mar","YTD","NotPTM","Wed",30001.949999999997]
["East Coast","Newson. L","Confections","Teatime Chocolate Biscuits",42445,172.1875,948.5,2016,3,"Mar","YTD","NotPTM","Wed",163319.84375]
["West Coast","Oddesy. Y","Meat/Poultry","Tourtière",42445,85.404999999999987,90,2016,3,"Mar","YTD","NotPTM","Wed",7686.4499999999989]
["East Coast","Anderson. P","Dairy Products","Camembert Pierrot",42446,61.987499999999997,139.5,2016,3,"Mar","YTD","NotPTM","Thu",8647.2562500000004]
["North Coast","Atterson. P","Grains/Cereals","Gnocchi di nonna Alice",42446,68.875,171,{"$f":"YEAR(E2331)","v":2016},{"$f":"MONTH(E2331)","v":3},{"$f":"TEXT(E2331,\"mmm\")","v":"Mar"},{"$f":"IF(I2331<MONTH(TODAY()),\"YTD\",\"Not YTD\")","v":"YTD"},{"$f":"IF(AND(E2331>=EarliestDate,E2331<=MostRecentDate),\"Past12Months\",\"NotPTM\")","v":"NotPTM"},{"$f":"TEXT(E2331,\"ddd\")","v":"Thu"},11777.625]
["North Coast","Atterson. P","Condiments","Original Frankfurter grüne Soße",42446,68.875,99,2016,3,"Mar","YTD","NotPTM","Thu",6818.625]
["North Coast","Oxford. D","Confections","Zaanse koeken",42446,190.095,34,2016,3,"Mar","YTD","NotPTM","Thu",6463.23]
["North Coast","Oxford. D","Confections","Zaanse koeken",42446,206.625,122,2016,3,"Mar","YTD","NotPTM","Thu",25208.25]
["South Coast","Moodley. L","Condiments","Gula Malacca",42447,55.099999999999994,87.5,2016,3,"Mar","YTD","NotPTM","Fri",4821.2499999999991]
["East Coast","Newson. L","Grains/Cereals","Gustaf's Knäckebröd",42447,165.29999999999998,94.5,2016,3,"Mar","YTD","NotPTM","Fri",15620.849999999999]
["North Coast","Connely. K","Beverages","Rhönbräu Klosterbier",42447,50.967499999999994,128,2016,3,"Mar","YTD","NotPTM","Fri",6523.8399999999992]
["East Coast","Newson. L","Meat/Poultry","Alice Mutton",42448,61.987499999999997,175.5,2016,3,"Mar","YTD","NotPTM","Sat",10878.80625]
["West Coast","Stanly. N","Dairy Products","Gudbrandsdalsost",42448,85.404999999999987,247.5,2016,3,"Mar","YTD","NotPTM","Sat",21137.737499999996]
["East Coast","Perks. M","Seafood","Ikura",42448,68.875,111.5,2016,3,"Mar","YTD","NotPTM","Sat",7679.5625]
["North Coast","Dinnel. M","Seafood","Nord-Ost Matjeshering",42448,9.6425000000000001,135,2016,3,"Mar","YTD","NotPTM","Sat",1301.7375]
["North Coast","Edford. O","Condiments","Northwoods Cranberry Sauce",42448,103.3125,180,2016,3,"Mar","YTD","NotPTM","Sat",18596.25]
["West Coast","Oddesy. Y","Dairy Products","Queso Cabrales",42448,34.4375,94.5,2016,3,"Mar","YTD","NotPTM","Sat",3254.34375]
["West Coast","Rooney. Y","Confections","Tarte au sucre",42448,151.52500000000001,40.5,2016,3,"Mar","YTD","NotPTM","Sat",6136.7624999999998]
["West Coast","Stanly. N","Meat/Poultry","Thüringer Rostbratwurst",42448,103.3125,197.5,2016,3,"Mar","YTD","NotPTM","Sat",20404.21875]
["West Coast","Pursly. U","Confections","Valkoinen suklaa",42448,86.782499999999985,73,2016,3,"Mar","YTD","NotPTM","Sat",6335.1224999999986]
["East Coast","Peters. K","Grains/Cereals","Wimmers gute Semmelknödel",42448,20.662499999999998,149.5,2016,3,"Mar","YTD","NotPTM","Sat",3089.0437499999998]
["North Coast","Edford. O","Condiments","Louisiana Fiery Hot Pepper Sauce",42449,73.007499999999993,94.5,2016,3,"Mar","YTD","NotPTM","Sun",6899.2087499999998]
["West Coast","Toonly. S","Grains/Cereals","Tunnbröd",42449,41.324999999999996,140.5,2016,3,"Mar","YTD","NotPTM","Sun",5806.1624999999995]
["North Coast","Atterson. P","Dairy Products","Geitost",42450,103.3125,112,2016,3,"Mar","YTD","NotPTM","Mon",11571]
["North Coast","Dinnel. M","Dairy Products","Queso Manchego La Pastora",42450,34.4375,128,2016,3,"Mar","YTD","NotPTM","Mon",4408]
["South Coast","Hannis. H","Dairy Products","Raclette Courdavault",42450,20.662499999999998,45,2016,3,"Mar","YTD","NotPTM","Mon",929.81249999999989]
["West Coast","Numkin. M","Dairy Products","Raclette Courdavault",42450,50.967499999999994,67.5,2016,3,"Mar","YTD","NotPTM","Mon",3440.3062499999996]
["South Coast","Hannis. H","Produce","Rössle Sauerkraut",42450,24.794999999999998,205,2016,3,"Mar","YTD","NotPTM","Mon",5082.9749999999995]
["East Coast","Peters. K","Beverages","Chang",42451,172.1875,85.5,2016,3,"Mar","YTD","NotPTM","Tue",14722.03125]
["West Coast","Oddesy. Y","Dairy Products","Geitost",42451,344.375,175.5,2016,3,"Mar","YTD","NotPTM","Tue",60437.8125]
["East Coast","Peters. K","Confections","Gumbär Gummibärchen",42451,34.4375,86,2016,3,"Mar","YTD","NotPTM","Tue",2961.625]
["East Coast","Peters. K","Seafood","Ikura",42451,61.987499999999997,139.5,2016,3,"Mar","YTD","NotPTM","Tue",8647.2562500000004]
["South Coast","Moodley. L","Beverages","Rhönbräu Klosterbier",42451,172.1875,34.5,2016,3,"Mar","YTD","NotPTM","Tue",5940.46875]
["North Coast","Edford. O","Confections","Teatime Chocolate Biscuits",42451,24.794999999999998,41,2016,3,"Mar","YTD","NotPTM","Tue",1016.5949999999999]
["South Coast","Ilknis. K","Produce","Uncle Bob's Organic Dried Pears",42451,155.6575,135,2016,3,"Mar","YTD","NotPTM","Tue",21013.762500000001]
["West Coast","Rooney. Y","Beverages","Chang",42452,48.212499999999999,43,2016,3,"Mar","YTD","NotPTM","Wed",2073.1374999999998]
["East Coast","Lavin. T","Beverages","Chartreuse verte",42452,172.1875,56,2016,3,"Mar","YTD","NotPTM","Wed",9642.5]
["East Coast","Johnson. A","Grains/Cereals","Gnocchi di nonna Alice",42452,96.424999999999997,171,2016,3,"Mar","YTD","NotPTM","Wed",16488.674999999999]
["South Coast","Jarison. P","Dairy Products","Mascarpone Fabioli",42452,34.4375,63,2016,3,"Mar","YTD","NotPTM","Wed",2169.5625]
["South Coast","Ilknis. K","Condiments","Original Frankfurter grüne Soße",42452,61.987499999999997,58.5,2016,3,"Mar","YTD","NotPTM","Wed",3626.2687499999997]
["South Coast","Lumford. T","Dairy Products","Raclette Courdavault",42452,68.875,198,2016,3,"Mar","YTD","NotPTM","Wed",13637.25]
["South Coast","Lumford. T","Dairy Products","Raclette Courdavault",42452,23.417499999999997,119.5,2016,3,"Mar","YTD","NotPTM","Wed",2798.3912499999997]
["South Coast","Jarison. P","Beverages","Rhönbräu Klosterbier",42452,34.4375,69.5,2016,3,"Mar","YTD","NotPTM","Wed",2393.40625]
["West Coast","Pursly. U","Meat/Poultry","Tourtière",42452,27.549999999999997,31.5,2016,3,"Mar","YTD","NotPTM","Wed",867.82499999999993]
["South Coast","Jarison. P","Dairy Products","Fløtemysost",42453,50.967499999999994,136.5,2016,3,"Mar","YTD","NotPTM","Thu",6957.0637499999993]
["East Coast","Johnson. A","Dairy Products","Gudbrandsdalsost",42453,86.782499999999985,162,2016,3,"Mar","YTD","NotPTM","Thu",{"$f":"F2372*G2372","v":14058.764999999998}]
["North Coast","Edford. O","Dairy Products","Gudbrandsdalsost",42453,11.02,162,2016,3,"Mar","YTD","NotPTM","Thu",1785.24]
["West Coast","Oddesy. Y","Confections","Gumbär Gummibärchen",42453,41.324999999999996,140.5,2016,3,"Mar","YTD","NotPTM","Thu",5806.1624999999995]
["West Coast","Oddesy. Y","Confections","Pavlova",42453,172.1875,78.5,2016,3,"Mar","YTD","NotPTM","Thu",13516.71875]
["North Coast","Altercon. C","Confections","Pavlova",42457,137.75,78.5,{"$f":"YEAR(E2376)","v":2016},{"$f":"MONTH(E2376)","v":3},{"$f":"TEXT(E2376,\"mmm\")","v":"Mar"},{"$f":"IF(I2376<MONTH(TODAY()),\"YTD\",\"Not YTD\")","v":"YTD"},{"$f":"IF(AND(E2376>=EarliestDate,E2376<=MostRecentDate),\"Past12Months\",\"NotPTM\")","v":"NotPTM"},{"$f":"TEXT(E2376,\"ddd\")","v":"Mon"},10813.375]
["West Coast","Pursly. U","Beverages","Chang",42458,11.02,85.5,2016,3,"Mar","YTD","NotPTM","Tue",942.20999999999992]
["East Coast","Anderson. P","Condiments","Gula Malacca",42458,41.324999999999996,43,2016,3,"Mar","YTD","NotPTM","Tue",1776.9749999999999]
["East Coast","Bonders. P","Beverages","Rhönbräu Klosterbier",42458,137.75,34.5,2016,3,"Mar","YTD","NotPTM","Tue",4752.375]
["East Coast","Perks. M","Beverages","Rhönbräu Klosterbier",42458,144.63749999999999,34.5,2016,3,"Mar","YTD","NotPTM","Tue",4989.9937499999996]
["South Coast","Ilknis. K","Confections","Scottish Longbreads",42458,20.662499999999998,56,2016,3,"Mar","YTD","NotPTM","Tue",1157.0999999999999]
["South Coast","Moodley. L","Meat/Poultry","Thüringer Rostbratwurst",42458,68.875,557,2016,3,"Mar","YTD","NotPTM","Tue",38363.375]
["West Coast","Stanly. N","Meat/Poultry","Tourtière",42458,103.3125,33.5,2016,3,"Mar","YTD","NotPTM","Tue",3460.96875]
["West Coast","Toonly. S","Meat/Poultry","Alice Mutton",42459,103.3125,175.5,2016,3,"Mar","YTD","NotPTM","Wed",18131.34375]
["South Coast","Grooner. T","Confections","Gumbär Gummibärchen",42459,68.875,171,2016,3,"Mar","YTD","NotPTM","Wed",11777.625]
["East Coast","Newson. L","Meat/Poultry","Mishi Kobe Niku",42459,206.625,33.5,2016,3,"Mar","YTD","NotPTM","Wed",6921.9375]
["West Coast","Rooney. Y","Condiments","Sirop d'érable",42459,17.907499999999999,128,2016,3,"Mar","YTD","NotPTM","Wed",2292.16]
["North Coast","Dinnel. M","Confections","Tarte au sucre",42459,68.875,221.5,2016,3,"Mar","YTD","NotPTM","Wed",15255.8125]
["West Coast","Toonly. S","Grains/Cereals","Tunnbröd",42459,137.75,171,2016,3,"Mar","YTD","NotPTM","Wed",23555.25]
["West Coast","Oddesy. Y","Seafood","Boston Crab Meat",42460,4.1324999999999994,82.5,2016,3,"Mar","YTD","NotPTM","Thu",340.93124999999998]
["South Coast","Grooner. T","Dairy Products","Raclette Courdavault",42460,103.3125,247.5,2016,3,"Mar","YTD","NotPTM","Thu",25569.84375]
["West Coast","Rooney. Y","Meat/Poultry","Alice Mutton",42461,109.07662500000002,236.92500000000001,2016,4,"Apr","YTD","NotPTM","Fri",25842.979378125005]
["East Coast","Johnson. A","Grains/Cereals","Gnocchi di nonna Alice",42461,302.99062500000002,184.27500000000001,2016,4,"Apr","YTD","NotPTM","Fri",55833.597421875005]
["South Coast","Hannis. H","Condiments","Grandma's Boysenberry Spread",42461,181.794375,60.750000000000007,2016,4,"Apr","YTD","NotPTM","Fri",11044.008281250002]
["North Coast","Altercon. C","Confections","NuNuCa Nuß-Nougat-Creme",42461,259.70625000000001,67.5,2016,4,"Apr","YTD","NotPTM","Fri",17530.171875]
["West Coast","Rooney. Y","Condiments","Louisiana Fiery Hot Pepper Sauce",42462,86.568749999999994,46.575000000000003,2016,4,"Apr","YTD","NotPTM","Sat",4031.9395312500001]
["North Coast","Atterson. P","Beverages","Rhönbräu Klosterbier",42462,77.911875000000009,46.575000000000003,2016,4,"Apr","YTD","NotPTM","Sat",3628.7455781250005]
["North Coast","Edford. O","Condiments","Aniseed Syrup",42463,150.629625,182.25,2016,4,"Apr","YTD","NotPTM","Sun",27452.24915625]
["East Coast","Johnson. A","Beverages","Chartreuse verte",42463,562.69687500000009,109.35000000000001,2016,4,"Apr","YTD","NotPTM","Sun",61530.903281250015]
["North Coast","Dinnel. M","Grains/Cereals","Singaporean Hokkien Fried Mee",42463,432.84375000000006,85.050000000000011,2016,4,"Apr","YTD","NotPTM","Sun",36813.360937500009]
["East Coast","Newson. L","Grains/Cereals","Singaporean Hokkien Fried Mee",42463,20.776500000000002,91.800000000000011,2016,4,"Apr","YTD","NotPTM","Sun",1907.2827000000004]
["East Coast","Newson. L","Grains/Cereals","Tunnbröd",42463,43.284374999999997,43.2,2016,4,"Apr","YTD","NotPTM","Sun",1869.885]
["South Coast","Jarison. P","Seafood","Boston Crab Meat",42464,129.85312500000001,60.750000000000007,2016,4,"Apr","YTD","NotPTM","Mon",7888.5773437500011]
["North Coast","Oxford. D","Dairy Products","Camembert Pierrot",42464,65.79225000000001,206.55,2016,4,"Apr","YTD","NotPTM","Mon",13589.389237500003]
["East Coast","Peters. K","Grains/Cereals","Filo Mix",42464,86.568749999999994,14.850000000000001,2016,4,"Apr","YTD","NotPTM","Mon",1285.5459375]
["East Coast","Newson. L","Grains/Cereals","Gnocchi di nonna Alice",42464,34.627499999999998,161.32500000000002,2016,4,"Apr","YTD","NotPTM","Mon",5586.2814374999998]
["South Coast","Ilknis. K","Grains/Cereals","Gustaf's Knäckebröd",42464,20.776500000000002,27,2016,4,"Apr","YTD","NotPTM","Mon",560.96550000000002]
["North Coast","Connely. K","Produce","Manjimup Dried Apples",42464,43.284374999999997,299.02500000000003,2016,4,"Apr","YTD","NotPTM","Mon",12943.110234375001]
["West Coast","Stanly. N","Dairy Products","Mozzarella di Giovanni",42464,43.284374999999997,168.75,2016,4,"Apr","YTD","NotPTM","Mon",7304.2382812499991]
["West Coast","Stanly. N","Dairy Products","Mozzarella di Giovanni",42464,216.42187500000003,212.625,2016,4,"Apr","YTD","NotPTM","Mon",46016.701171875007]
["West Coast","Oddesy. Y","Seafood","Nord-Ost Matjeshering",42464,65.79225000000001,157.27500000000001,2016,4,"Apr","YTD","NotPTM","Mon",10347.476118750003]
["South Coast","Ilknis. K","Beverages","Steeleye Stout",42464,17.313749999999999,109.35000000000001,2016,4,"Apr","YTD","NotPTM","Mon",1893.2585624999999]
["West Coast","Oddesy. Y","Produce","Tofu",42464,13.851000000000001,141.07500000000002,2016,4,"Apr","YTD","NotPTM","Mon",1954.0298250000003]
["South Coast","Moodley. L","Confections","Valkoinen suklaa",42464,86.568749999999994,276.75,2016,4,"Apr","YTD","NotPTM","Mon",23957.901562499999]
["North Coast","Oxford. D","Confections","Zaanse koeken",42464,193.91400000000002,230.85000000000002,2016,4,"Apr","YTD","NotPTM","Mon",44765.046900000008]
["South Coast","Lumford. T","Confections","Zaanse koeken",42464,43.284374999999997,118.12500000000001,2016,4,"Apr","YTD","NotPTM","Mon",5112.966796875]
["North Coast","Altercon. C","Produce","Uncle Bob's Organic Dried Pears",42465,17.313749999999999,127.575,2016,4,"Apr","YTD","NotPTM","Tue",2208.8016562499997]
["South Coast","Kinsly. N","Grains/Cereals","Wimmers gute Semmelknödel",42465,64.060874999999996,43.875,2016,4,"Apr","YTD","NotPTM","Tue",2810.6708906249996]
["East Coast","Anderson. P","Dairy Products","Geitost",42466,43.284374999999997,157.27500000000001,2016,4,"Apr","YTD","NotPTM","Wed",6807.5500781249993]
["North Coast","Dinnel. M","Dairy Products","Mozzarella di Giovanni",42466,39.821625000000004,211.27500000000001,2016,4,"Apr","YTD","NotPTM","Wed",8413.3138218750009]
["North Coast","Dinnel. M","Dairy Products","Mozzarella di Giovanni",42466,60.598124999999996,145.80000000000001,2016,4,"Apr","YTD","NotPTM","Wed",8835.2066250000007]
["South Coast","Franly. S","Beverages","Outback Lager",42466,38.090250000000005,109.35000000000001,2016,4,"Apr","YTD","NotPTM","Wed",4165.1688375000012]
["South Coast","Grooner. T","Dairy Products","Queso Cabrales",42466,216.42187500000003,109.35000000000001,2016,4,"Apr","YTD","NotPTM","Wed",23665.732031250005]
["North Coast","Oxford. D","Beverages","Chai",42467,17.313749999999999,109.35000000000001,2016,4,"Apr","YTD","NotPTM","Thu",1893.2585624999999]
["South Coast","Kinsly. N","Dairy Products","Fløtemysost",42467,65.79225000000001,103.95,2016,4,"Apr","YTD","NotPTM","Thu",6839.1043875000014]
["West Coast","Rooney. Y","Condiments","Grandma's Boysenberry Spread",42467,129.85312500000001,151.875,2016,4,"Apr","YTD","NotPTM","Thu",19721.443359375]
["East Coast","Perks. M","Beverages","Guaraná Fantástica",42467,60.598124999999996,27,2016,4,"Apr","YTD","NotPTM","Thu",1636.149375]
["East Coast","Perks. M","Beverages","Guaraná Fantástica",42467,51.941250000000004,93.825000000000003,2016,4,"Apr","YTD","NotPTM","Thu",4873.3877812500004]
["North Coast","Altercon. C","Produce","Longlife Tofu",42467,34.627499999999998,87.075000000000003,2016,4,"Apr","YTD","NotPTM","Thu",3015.1895624999997]
["North Coast","Oxford. D","Meat/Poultry","Pâté chinois",42467,173.13749999999999,236.92500000000001,2016,4,"Apr","YTD","NotPTM","Thu",41020.602187500001]
["South Coast","Grooner. T","Produce","Rössle Sauerkraut",42467,77.911875000000009,42.525000000000006,2016,4,"Apr","YTD","NotPTM","Thu",3313.2024843750009]
["East Coast","Bonders. P","Produce","Uncle Bob's Organic Dried Pears",42467,43.284374999999997,182.25,2016,4,"Apr","YTD","NotPTM","Thu",7888.5773437499993]
["East Coast","Johnson. A","Meat/Poultry","Alice Mutton",42468,51.941250000000004,85.050000000000011,2016,4,"Apr","YTD","NotPTM","Fri",4417.6033125000013]
["North Coast","Dinnel. M","Grains/Cereals","Filo Mix",42468,65.79225000000001,42.525000000000006,2016,4,"Apr","YTD","NotPTM","Fri",2797.815431250001]
["South Coast","Lumford. T","Dairy Products","Fløtemysost",42468,216.42187500000003,75.600000000000009,2016,4,"Apr","YTD","NotPTM","Fri",16361.493750000003]
["North Coast","Altercon. C","Condiments","Genen Shouyu",42468,280.48275000000007,218.70000000000002,2016,4,"Apr","YTD","NotPTM","Fri",{"$f":"F2436*G2436","v":61341.577425000018}]
["West Coast","Numkin. M","Condiments","Sirop d'érable",42468,64.060874999999996,127.575,2016,4,"Apr","YTD","NotPTM","Fri",8172.5661281249995]
["West Coast","Numkin. M","Confections","Teatime Chocolate Biscuits",42468,51.941250000000004,751.95,2016,4,"Apr","YTD","NotPTM","Fri",39057.222937500002]
["West Coast","Rooney. Y","Dairy Products","Gudbrandsdalsost",42469,51.941250000000004,127.575,{"$f":"YEAR(E2439)","v":2016},{"$f":"MONTH(E2439)","v":4},{"$f":"TEXT(E2439,\"mmm\")","v":"Apr"},{"$f":"IF(I2439<MONTH(TODAY()),\"YTD\",\"Not YTD\")","v":"YTD"},{"$f":"IF(AND(E2439>=EarliestDate,E2439<=MostRecentDate),\"Past12Months\",\"NotPTM\")","v":"NotPTM"},{"$f":"TEXT(E2439,\"ddd\")","v":"Sat"},6626.404968750001]
["South Coast","Hannis. H","Meat/Poultry","Alice Mutton",42470,129.85312500000001,109.35000000000001,2016,4,"Apr","YTD","NotPTM","Sun",14199.439218750002]
["East Coast","Lavin. T","Seafood","Boston Crab Meat",42470,43.284374999999997,299.02500000000003,2016,4,"Apr","YTD","NotPTM","Sun",12943.110234375001]
["West Coast","Rooney. Y","Dairy Products","Fløtemysost",42470,29.433375000000005,46.575000000000003,2016,4,"Apr","YTD","NotPTM","Sun",1370.8594406250004]
["West Coast","Numkin. M","Confections","Schoggi Schokolade",42470,12.119625000000001,60.750000000000007,2016,4,"Apr","YTD","NotPTM","Sun",736.2672187500001]
["North Coast","Connely. K","Seafood","Carnarvon Tigers",42471,77.911875000000009,220.72500000000002,2016,4,"Apr","YTD","NotPTM","Mon",17197.098609375003]
["East Coast","Newson. L","Dairy Products","Gorgonzola Telino",42471,69.254999999999995,75.600000000000009,2016,4,"Apr","YTD","NotPTM","Mon",5235.6779999999999]
["South Coast","Ilknis. K","Produce","Manjimup Dried Apples",42471,129.85312500000001,115.42500000000001,2016,4,"Apr","YTD","NotPTM","Mon",14988.296953125002]
["East Coast","Johnson. A","Grains/Cereals","Ravioli Angelo",42471,25.970625000000002,76.95,2016,4,"Apr","YTD","NotPTM","Mon",1998.4395937500003]
["West Coast","Toonly. S","Beverages","Rhönbräu Klosterbier",42471,138.51,85.050000000000011,2016,4,"Apr","YTD","NotPTM","Mon",11780.275500000002]
["West Coast","Toonly. S","Produce","Tofu",42471,12.119625000000001,276.75,2016,4,"Apr","YTD","NotPTM","Mon",3354.1062187500002]
["West Coast","Pursly. U","Beverages","Lakkalikööri",42472,43.284374999999997,109.35000000000001,2016,4,"Apr","YTD","NotPTM","Tue",4733.1464062499999]
["West Coast","Oddesy. Y","Produce","Manjimup Dried Apples",42472,13.851000000000001,321.97500000000002,2016,4,"Apr","YTD","NotPTM","Tue",4459.675725000001]
["North Coast","Atterson. P","Meat/Poultry","Thüringer Rostbratwurst",42472,155.82375000000002,751.95,2016,4,"Apr","YTD","NotPTM","Tue",117171.66881250002]
["South Coast","Kinsly. N","Meat/Poultry","Thüringer Rostbratwurst",42472,86.568749999999994,751.95,2016,4,"Apr","YTD","NotPTM","Tue",65095.371562499997]
["South Coast","Franly. S","Seafood","Boston Crab Meat",42473,91.762875000000008,89.100000000000009,2016,4,"Apr","YTD","NotPTM","Wed",8176.0721625000015]
["South Coast","Franly. S","Seafood","Boston Crab Meat",42473,129.85312500000001,45.900000000000006,2016,4,"Apr","YTD","NotPTM","Wed",5960.2584375000006]
["South Coast","Jarison. P","Produce","Rössle Sauerkraut",42473,29.433375000000005,211.27500000000001,2016,4,"Apr","YTD","NotPTM","Wed",6218.5363031250008]
["West Coast","Oddesy. Y","Dairy Products","Camembert Pierrot",42474,216.42187500000003,206.55,2016,4,"Apr","YTD","NotPTM","Thu",44701.938281250012]
["East Coast","Perks. M","Dairy Products","Gorgonzola Telino",42474,216.42187500000003,75.600000000000009,2016,4,"Apr","YTD","NotPTM","Thu",16361.493750000003]
["West Coast","Stanly. N","Dairy Products","Gorgonzola Telino",42474,152.36100000000002,60.750000000000007,2016,4,"Apr","YTD","NotPTM","Thu",9255.9307500000014]
["West Coast","Rooney. Y","Condiments","Louisiana Fiery Hot Pepper Sauce",42474,86.568749999999994,33.75,2016,4,"Apr","YTD","NotPTM","Thu",2921.6953125]
["South Coast","Lumford. T","Confections","Teatime Chocolate Biscuits",42474,225.07875000000001,43.875,2016,4,"Apr","YTD","NotPTM","Thu",9875.3301562500001]
["South Coast","Lumford. T","Confections","Teatime Chocolate Biscuits",42474,150.629625,161.32500000000002,2016,4,"Apr","YTD","NotPTM","Thu",24300.324253125003]
["North Coast","Edford. O","Seafood","Konbu",42475,57.13537500000001,36.450000000000003,2016,4,"Apr","YTD","NotPTM","Fri",2082.5844187500006]
["East Coast","Newson. L","Produce","Manjimup Dried Apples",42475,65.79225000000001,321.97500000000002,2016,4,"Apr","YTD","NotPTM","Fri",21183.459693750006]
["East Coast","Anderson. P","Dairy Products","Mozzarella di Giovanni",42475,5.1941250000000005,211.27500000000001,2016,4,"Apr","YTD","NotPTM","Fri",1097.3887593750001]
["East Coast","Anderson. P","Dairy Products","Mozzarella di Giovanni",42475,38.090250000000005,130.27500000000001,2016,4,"Apr","YTD","NotPTM","Fri",4962.2073187500009]
["West Coast","Pursly. U","Beverages","Outback Lager",42475,150.629625,75.600000000000009,2016,4,"Apr","YTD","NotPTM","Fri",11387.599650000002]
["South Coast","Jarison. P","Meat/Poultry","Pâté chinois",42475,107.34524999999999,85.050000000000011,2016,4,"Apr","YTD","NotPTM","Fri",9129.7135125000004]
["West Coast","Oddesy. Y","Grains/Cereals","Singaporean Hokkien Fried Mee",42475,138.51,85.050000000000011,2016,4,"Apr","YTD","NotPTM","Fri",11780.275500000002]
["North Coast","Atterson. P","Beverages","Chartreuse verte",42476,25.970625000000002,57.375000000000007,2016,4,"Apr","YTD","NotPTM","Sat",1490.0646093750004]
["East Coast","Lavin. T","Condiments","Original Frankfurter grüne Soße",42476,17.313749999999999,43.875,2016,4,"Apr","YTD","NotPTM","Sat",759.64078124999992]
["West Coast","Rooney. Y","Beverages","Outback Lager",42476,64.060874999999996,109.35000000000001,2016,4,"Apr","YTD","NotPTM","Sat",7005.0566812500001]
["East Coast","Johnson. A","Confections","Pavlova",42476,8.6568749999999994,109.35000000000001,2016,4,"Apr","YTD","NotPTM","Sat",946.62928124999996]
["West Coast","Rooney. Y","Confections","Scottish Longbreads",42476,43.284374999999997,62.775000000000006,2016,4,"Apr","YTD","NotPTM","Sat",2717.1766406249999]
["North Coast","Oxford. D","Seafood","Boston Crab Meat",42477,86.568749999999994,12.15,2016,4,"Apr","YTD","NotPTM","Sun",1051.8103125]
["North Coast","Altercon. C","Dairy Products","Gorgonzola Telino",42477,5.1941250000000005,75.600000000000009,2016,4,"Apr","YTD","NotPTM","Sun",392.67585000000008]
["East Coast","Johnson. A","Produce","Manjimup Dried Apples",42477,121.19624999999999,321.97500000000002,2016,4,"Apr","YTD","NotPTM","Sun",39022.162593749999]
["South Coast","Jarison. P","Meat/Poultry","Tourtière",42477,13.851000000000001,45.225000000000001,2016,4,"Apr","YTD","NotPTM","Sun",626.41147500000011]
["East Coast","Bonders. P","Confections","Chocolade",42478,25.970625000000002,76.95,2016,4,"Apr","YTD","NotPTM","Mon",1998.4395937500003]
["South Coast","Kinsly. N","Dairy Products","Gorgonzola Telino",42478,64.060874999999996,115.42500000000001,2016,4,"Apr","YTD","NotPTM","Mon",7394.2264968750005]
["South Coast","Lumford. T","Dairy Products","Mozzarella di Giovanni",42478,31.164749999999998,211.27500000000001,2016,4,"Apr","YTD","NotPTM","Mon",6584.3325562499995]
["East Coast","Perks. M","Seafood","Escargots de Bourgogne",42479,129.85312500000001,60.750000000000007,2016,4,"Apr","YTD","NotPTM","Tue",7888.5773437500011]
["East Coast","Bonders. P","Dairy Products","Geitost",42479,43.284374999999997,109.35000000000001,2016,4,"Apr","YTD","NotPTM","Tue",4733.1464062499999]
["West Coast","Numkin. M","Condiments","Louisiana Fiery Hot Pepper Sauce",42479,121.19624999999999,101.92500000000001,2016,4,"Apr","YTD","NotPTM","Tue",12352.92778125]
["West Coast","Oddesy. Y","Condiments","Original Frankfurter grüne Soße",42479,238.92975000000001,62.775000000000006,2016,4,"Apr","YTD","NotPTM","Tue",14998.815056250001]
["North Coast","Altercon. C","Meat/Poultry","Pâté chinois",42479,173.13749999999999,48.6,2016,4,"Apr","YTD","NotPTM","Tue",8414.4825000000001]
["South Coast","Grooner. T","Meat/Poultry","Perth Pasties",42479,90.031500000000008,118.12500000000001,2016,4,"Apr","YTD","NotPTM","Tue",10634.970937500002]
["North Coast","Atterson. P","Dairy Products","Raclette Courdavault",42487,31.164749999999998,334.125,{"$f":"YEAR(E2488)","v":2016},{"$f":"MONTH(E2488)","v":4},{"$f":"TEXT(E2488,\"mmm\")","v":"Apr"},{"$f":"IF(I2488<MONTH(TODAY()),\"YTD\",\"Not YTD\")","v":"YTD"},{"$f":"IF(AND(E2488>=EarliestDate,E2488<=MostRecentDate),\"Past12Months\",\"NotPTM\")","v":"NotPTM"},{"$f":"TEXT(E2488,\"ddd\")","v":"Wed"},10412.922093749999]
["South Coast","Franly. S","Dairy Products","Raclette Courdavault",42487,155.82375000000002,37.125,2016,4,"Apr","YTD","NotPTM","Wed",5784.9567187500006]
["South Coast","Kinsly. N","Confections","Teatime Chocolate Biscuits",42487,86.568749999999994,276.75,2016,4,"Apr","YTD","NotPTM","Wed",23957.901562499999]
["South Coast","Grooner. T","Produce","Tofu",42487,152.36100000000002,112.72500000000001,2016,4,"Apr","YTD","NotPTM","Wed",17174.893725000002]
["East Coast","Lavin. T","Confections","Gumbär Gummibärchen",42488,86.568749999999994,189.67500000000001,2016,4,"Apr","YTD","NotPTM","Thu",16419.927656249998]
["West Coast","Oddesy. Y","Beverages","Outback Lager",42488,259.70625000000001,230.85000000000002,2016,4,"Apr","YTD","NotPTM","Thu",59953.187812500008]
["West Coast","Oddesy. Y","Confections","Pavlova",42488,77.911875000000009,84.375,2016,4,"Apr","YTD","NotPTM","Thu",6573.8144531250009]
["North Coast","Edford. O","Seafood","Boston Crab Meat",42495,321.2890625,124.25273437500002,{"$f":"YEAR(E2495)","v":2016},{"$f":"MONTH(E2495)","v":5},{"$f":"TEXT(E2495,\"mmm\")","v":"May"},{"$f":"IF(I2495<MONTH(TODAY()),\"YTD\",\"Not YTD\")","v":"YTD"},{"$f":"IF(AND(E2495>=EarliestDate,E2495<=MostRecentDate),\"Past12Months\",\"NotPTM\")","v":"NotPTM"},{"$f":"TEXT(E2495,\"ddd\")","v":"Thu"},39921.044540405281]
["North Coast","Connely. K","Dairy Products","Camembert Pierrot",42495,321.2890625,124.25273437500002,2016,5,"May","YTD","NotPTM","Thu",39921.044540405281]
["West Coast","Toonly. S","Beverages","Chai",42495,68.359375,192.78,2016,5,"May","YTD","NotPTM","Thu",13178.3203125]
["South Coast","Lumford. T","Dairy Products","Fløtemysost",42495,9.5703125,30.121874999999996,2016,5,"May","YTD","NotPTM","Thu",288.27575683593744]
["South Coast","Kinsly. N","Confections","Sir Rodney's Scones",42495,205.078125,67.774218750000003,2016,5,"May","YTD","NotPTM","Thu",13899.009704589844]
["West Coast","Stanly. N","Confections","Valkoinen suklaa",42495,86.1328125,88.106484375000008,2016,5,"May","YTD","NotPTM","Thu",{"$f":"F2500*G2500","v":7588.8592987060556}]
["West Coast","Rooney. Y","Dairy Products","Raclette Courdavault",42496,68.359375,30.121874999999996,2016,5,"May","YTD","NotPTM","Fri",2059.1125488281245]
["North Coast","Edford. O","Condiments","Aniseed Syrup",42497,84.765625,104.67351562499999,2016,5,"May","YTD","NotPTM","Sat",8872.7159729003906]
["North Coast","Oxford. D","Beverages","Chai",42497,68.359375,121.99359375000002,2016,5,"May","YTD","NotPTM","Sat",8339.4058227539081]
["East Coast","Perks. M","Seafood","Inlagd Sill",42497,50.5859375,195.03914062500002,2016,5,"May","YTD","NotPTM","Sat",9866.2377777099609]
["East Coast","Anderson. P","Produce","Tofu",42497,13.671875,40.664531250000003,2016,5,"May","YTD","NotPTM","Sat",555.96038818359375]
["West Coast","Oddesy. Y","Beverages","Outback Lager",42498,50.5859375,142.32585937499999,2016,5,"May","YTD","NotPTM","Sun",7199.6870269775391]
["East Coast","Johnson. A","Beverages","Chartreuse verte",42499,10.9375,121.99359375000002,2016,5,"May","YTD","NotPTM","Mon",1334.3049316406252]
["East Coast","Johnson. A","Condiments","Genen Shouyu",42499,50.5859375,311.76140625000005,2016,5,"May","YTD","NotPTM","Mon",15770.743011474611]
["West Coast","Pursly. U","Dairy Products","Queso Cabrales",42499,51.953125,142.32585937499999,2016,5,"May","YTD","NotPTM","Mon",7394.2731628417969]
["West Coast","Stanly. N","Produce","Tofu",42499,41.015625,125.75882812500001,2016,5,"May","YTD","NotPTM","Mon",5158.0769348144531]
["West Coast","Stanly. N","Produce","Tofu",42499,47.8515625,97.143046874999996,2016,5,"May","YTD","NotPTM","Mon",4648.4465789794922]
["North Coast","Altercon. C","Confections","Zaanse koeken",42499,16.40625,121.99359375000002,2016,5,"May","YTD","NotPTM","Mon",2001.4573974609377]
["East Coast","Lavin. T","Seafood","Boston Crab Meat",42500,102.5390625,124.25273437500002,2016,5,"May","YTD","NotPTM","Tue",12740.758895874025]
["South Coast","Jarison. P","Dairy Products","Fløtemysost",42500,118.9453125,101.66132812499998,2016,5,"May","YTD","NotPTM","Tue",12092.138442993162]
["West Coast","Toonly. S","Dairy Products","Gorgonzola Telino",42500,9.5703125,359.20335937499999,2016,5,"May","YTD","NotPTM","Tue",3437.6884002685547]
["South Coast","Moodley. L","Condiments","Gula Malacca",42500,68.359375,105.4265625,2016,5,"May","YTD","NotPTM","Tue",7206.8939208984375]
["East Coast","Newson. L","Seafood","Ikura",42500,153.125,243.98718750000003,2016,5,"May","YTD","NotPTM","Tue",37360.538085937507]
["East Coast","Bonders. P","Produce","Manjimup Dried Apples",42500,102.5390625,124.25273437500002,2016,5,"May","YTD","NotPTM","Tue",12740.758895874025]
["East Coast","Anderson. P","Condiments","Sirop d'érable",42500,410.15625,192.78,2016,5,"May","YTD","NotPTM","Tue",79069.921875]
["South Coast","Lumford. T","Beverages","Steeleye Stout",42500,34.1796875,333.59976562500003,2016,5,"May","YTD","NotPTM","Tue",11402.335739135744]
["South Coast","Moodley. L","Grains/Cereals","Gnocchi di nonna Alice",42501,17.7734375,257.54203125000004,2016,5,"May","YTD","NotPTM","Wed",4577.4071960449228]
["South Coast","Hannis. H","Beverages","Lakkalikööri",42501,34.1796875,121.99359375000002,2016,5,"May","YTD","NotPTM","Wed",4169.702911376954]
["North Coast","Edford. O","Condiments","Louisiana Hot Spiced Okra",42501,170.8984375,115.216171875,2016,5,"May","YTD","NotPTM","Wed",19690.263748168945]
["South Coast","Jarison. P","Seafood","Röd Kaviar",42501,84.765625,121.99359375000002,2016,5,"May","YTD","NotPTM","Wed",10340.863220214846]
["West Coast","Rooney. Y","Seafood","Carnarvon Tigers",42502,61.5234375,423.21234375,2016,5,"May","YTD","NotPTM","Thu",26037.478179931641]
["North Coast","Dinnel. M","Condiments","Chef Anton's Cajun Seasoning",42502,34.1796875,124.25273437500002,2016,5,"May","YTD","NotPTM","Thu",4246.9196319580087]
["North Coast","Atterson. P","Seafood","Inlagd Sill",42502,20.5078125,128.77101562500002,2016,5,"May","YTD","NotPTM","Thu",2640.8118438720708]
["West Coast","Numkin. M","Beverages","Lakkalikööri",42504,47.8515625,97.143046874999996,2016,5,"May","YTD","NotPTM","Sat",4648.4465789794922]
["West Coast","Rooney. Y","Condiments","Louisiana Fiery Hot Pepper Sauce",42504,120.3125,113.710078125,2016,5,"May","YTD","NotPTM","Sat",13680.743774414063]
["East Coast","Lavin. T","Dairy Products","Mozzarella di Giovanni",42504,72.4609375,235.703671875,{"$f":"YEAR(E2530)","v":2016},{"$f":"MONTH(E2530)","v":5},{"$f":"TEXT(E2530,\"mmm\")","v":"May"},{"$f":"IF(I2530<MONTH(TODAY()),\"YTD\",\"Not YTD\")","v":"YTD"},{"$f":"IF(AND(E2530>=EarliestDate,E2530<=MostRecentDate),\"Past12Months\",\"NotPTM\")","v":"NotPTM"},{"$f":"TEXT(E2530,\"ddd\")","v":"Sat"},17079.309036254883]
["South Coast","Lumford. T","Dairy Products","Queso Manchego La Pastora",42504,51.953125,257.54203125000004,2016,5,"May","YTD","NotPTM","Sat",13380.113342285158]
["East Coast","Lavin. T","Dairy Products","Raclette Courdavault",42504,34.1796875,230.43234375,2016,5,"May","YTD","NotPTM","Sat",7876.1054992675781]
["North Coast","Altercon. C","Confections","Schoggi Schokolade",42504,170.8984375,297.45351562499997,2016,5,"May","YTD","NotPTM","Sat",50834.341049194329]
["North Coast","Altercon. C","Confections","Teatime Chocolate Biscuits",42504,6.8359375,64.762031250000007,2016,5,"May","YTD","NotPTM","Sat",442.70919799804693]
["North Coast","Atterson. P","Dairy Products","Gorgonzola Telino",42505,68.359375,84.341250000000002,2016,5,"May","YTD","NotPTM","Sun",5765.51513671875]
["North Coast","Oxford. D","Produce","Manjimup Dried Apples",42505,68.359375,257.54203125000004,2016,5,"May","YTD","NotPTM","Sun",17605.412292480472]
["South Coast","Hannis. H","Seafood","Røgede sild",42505,9.5703125,50.454140624999994,2016,5,"May","YTD","NotPTM","Sun",482.86189270019526]
["North Coast","Connely. K","Grains/Cereals","Wimmers gute Semmelknödel",42505,109.375,60.996796875000008,2016,5,"May","YTD","NotPTM","Sun",6671.5246582031259]
["East Coast","Perks. M","Beverages","Côte de Blaye",42506,68.359375,81.329062500000006,2016,5,"May","YTD","NotPTM","Mon",5559.6038818359375]
["South Coast","Kinsly. N","Dairy Products","Gorgonzola Telino",42508,34.1796875,84.341250000000002,2016,5,"May","YTD","NotPTM","Wed",2882.757568359375]
["North Coast","Connely. K","Seafood","Ikura",42508,82.03125,108.43875,2016,5,"May","YTD","NotPTM","Wed",8895.3662109375]
["North Coast","Connely. K","Seafood","Ikura",42508,102.5390625,271.09687500000001,2016,5,"May","YTD","NotPTM","Wed",27798.019409179688]
["East Coast","Perks. M","Dairy Products","Mozzarella di Giovanni",42508,68.359375,257.54203125000004,2016,5,"May","YTD","NotPTM","Wed",17605.412292480472]
["East Coast","Lavin. T","Condiments","Northwoods Cranberry Sauce",42508,30.078125,81.329062500000006,2016,5,"May","YTD","NotPTM","Wed",2446.2257080078125]
["East Coast","Johnson. A","Beverages","Rhönbräu Klosterbier",42508,47.8515625,16.567031249999999,2016,5,"May","YTD","NotPTM","Wed",792.75833129882813]
["North Coast","Oxford. D","Seafood","Boston Crab Meat",42509,41.015625,372.75820312499997,2016,5,"May","YTD","NotPTM","Thu",15288.910675048826]
["South Coast","Moodley. L","Beverages","Chang",42509,68.359375,64.762031250000007,2016,5,"May","YTD","NotPTM","Thu",4427.0919799804697]
["East Coast","Perks. M","Seafood","Escargots de Bourgogne",42509,20.5078125,89.612578124999999,2016,5,"May","YTD","NotPTM","Thu",1837.7579498291016]
["East Coast","Perks. M","Seafood","Ikura",42509,50.5859375,68.527265624999998,2016,5,"May","YTD","NotPTM","Thu",3466.5159759521484]
["South Coast","Franly. S","Meat/Poultry","Perth Pasties",42509,20.5078125,297.45351562499997,2016,5,"May","YTD","NotPTM","Thu",6100.1209259033194]
["North Coast","Altercon. C","Grains/Cereals","Singaporean Hokkien Fried Mee",42509,95.703125,94.88390625000001,2016,5,"May","YTD","NotPTM","Thu",9080.6863403320331]
["South Coast","Moodley. L","Confections","Tarte au sucre",42509,136.71875,94.88390625000001,2016,5,"May","YTD","NotPTM","Thu",12972.409057617189]
["East Coast","Bonders. P","Grains/Cereals","Wimmers gute Semmelknödel",42509,102.5390625,179.97820312500002,2016,5,"May","YTD","NotPTM","Thu",18454.796218872074]
["East Coast","Peters. K","Grains/Cereals","Wimmers gute Semmelknödel",42509,61.5234375,264.319453125,2016,5,"May","YTD","NotPTM","Thu",16261.841354370117]
["North Coast","Edford. O","Confections","Maxilaku",42510,47.8515625,54.219374999999999,2016,5,"May","YTD","NotPTM","Fri",2594.4818115234375]
["East Coast","Johnson. A","Dairy Products","Raclette Courdavault",42510,84.765625,243.98718750000003,2016,5,"May","YTD","NotPTM","Fri",20681.726440429691]
["East Coast","Perks. M","Meat/Poultry","Tourtière",42510,34.1796875,203.32265624999997,2016,5,"May","YTD","NotPTM","Fri",6949.504852294921]
["North Coast","Atterson. P","Dairy Products","Raclette Courdavault",42517,82.03125,225.16101562500003,{"$f":"YEAR(E2558)","v":2016},{"$f":"MONTH(E2558)","v":5},{"$f":"TEXT(E2558,\"mmm\")","v":"May"},{"$f":"IF(I2558<MONTH(TODAY()),\"YTD\",\"Not YTD\")","v":"YTD"},{"$f":"IF(AND(E2558>=EarliestDate,E2558<=MostRecentDate),\"Past12Months\",\"NotPTM\")","v":"NotPTM"},{"$f":"TEXT(E2558,\"ddd\")","v":"Fri"},18470.239562988285]
["South Coast","Moodley. L","Seafood","Røgede sild",42517,68.359375,121.99359375000002,2016,5,"May","YTD","NotPTM","Fri",8339.4058227539081]
["South Coast","Franly. S","Confections","Scottish Longbreads",42517,102.5390625,311.76140625000005,2016,5,"May","YTD","NotPTM","Fri",31967.722320556644]
["South Coast","Kinsly. N","Confections","Teatime Chocolate Biscuits",42517,102.5390625,61.749843749999997,2016,5,"May","YTD","NotPTM","Fri",6331.7710876464844]
["North Coast","Edford. O","Meat/Poultry","Alice Mutton",42518,136.71875,118.228359375,2016,5,"May","YTD","NotPTM","Sat",16164.033508300781]
["East Coast","Perks. M","Grains/Cereals","Gnocchi di nonna Alice",42518,136.71875,257.54203125000004,2016,5,"May","YTD","NotPTM","Sat",35210.824584960945]
["East Coast","Perks. M","Grains/Cereals","Gnocchi di nonna Alice",42518,82.03125,271.09687500000001,2016,5,"May","YTD","NotPTM","Sat",{"$f":"F2564*G2564","v":22238.41552734375}]
["North Coast","Connely. K","Beverages","Chang",42521,68.359375,128.77101562500002,2016,5,"May","YTD","NotPTM","Tue",8802.7061462402362]
["West Coast","Toonly. S","Grains/Cereals","Filo Mix",42521,50.5859375,175.45992187499999,2016,5,"May","YTD","NotPTM","Tue",8875.8046417236328]
["South Coast","Ilknis. K","Dairy Products","Raclette Courdavault",42521,68.359375,308.74921875000001,2016,5,"May","YTD","NotPTM","Tue",21105.903625488281]
["North Coast","Edford. O","Confections","Scottish Longbreads",42521,102.5390625,67.774218750000003,2016,5,"May","YTD","NotPTM","Tue",6949.5048522949219]
["North Coast","Oxford. D","Beverages","Chai",42522,88,81,2016,6,"Jun","YTD","NotPTM","Wed",7128]
["West Coast","Oddesy. Y","Dairy Products","Fløtemysost",42522,150,77,2016,6,"Jun","YTD","NotPTM","Wed",11550]
["South Coast","Lumford. T","Grains/Cereals","Gnocchi di nonna Alice",42526,100,136.5,{"$f":"YEAR(E2571)","v":2016},{"$f":"MONTH(E2571)","v":6},{"$f":"TEXT(E2571,\"mmm\")","v":"Jun"},{"$f":"IF(I2571<MONTH(TODAY()),\"YTD\",\"Not YTD\")","v":"YTD"},{"$f":"IF(AND(E2571>=EarliestDate,E2571<=MostRecentDate),\"Past12Months\",\"NotPTM\")","v":"NotPTM"},{"$f":"TEXT(E2571,\"ddd\")","v":"Sun"},13650]
["North Coast","Atterson. P","Beverages","Guaraná Fantástica",42526,63,16,2016,6,"Jun","YTD","NotPTM","Sun",1008]
["South Coast","Kinsly. N","Beverages","Guaraná Fantástica",42526,13,20,2016,6,"Jun","YTD","NotPTM","Sun",260]
["East Coast","Lavin. T","Seafood","Inlagd Sill",42526,75,85.5,2016,6,"Jun","YTD","NotPTM","Sun",6412.5]
["West Coast","Toonly. S","Beverages","Outback Lager",42526,20,56,2016,6,"Jun","YTD","NotPTM","Sun",1120]
["North Coast","Dinnel. M","Beverages","Chang",42527,50,85.5,2016,6,"Jun","YTD","NotPTM","Mon",4275]
["South Coast","Jarison. P","Beverages","Guaraná Fantástica",42527,70,16,2016,6,"Jun","YTD","NotPTM","Mon",1120]
["South Coast","Franly. S","Condiments","Gula Malacca",42527,40,175.5,2016,6,"Jun","YTD","NotPTM","Mon",7020]
["East Coast","Peters. K","Beverages","Sasquatch Ale",42527,112,68,2016,6,"Jun","YTD","NotPTM","Mon",7616]
["North Coast","Dinnel. M","Confections","Tarte au sucre",42527,38,221.5,2016,6,"Jun","YTD","NotPTM","Mon",8417]
["East Coast","Lavin. T","Seafood","Boston Crab Meat",42528,5,66,2016,6,"Jun","YTD","NotPTM","Tue",330]
["North Coast","Dinnel. M","Grains/Cereals","Filo Mix",42528,50,128,2016,6,"Jun","YTD","NotPTM","Tue",6400]
["East Coast","Johnson. A","Dairy Products","Gudbrandsdalsost",42528,38,129.5,2016,6,"Jun","YTD","NotPTM","Tue",4921]
["East Coast","Perks. M","Seafood","Inlagd Sill",42528,13,68,2016,6,"Jun","YTD","NotPTM","Tue",884]
["South Coast","Grooner. T","Dairy Products","Raclette Courdavault",42531,50,221.5,2016,6,"Jun","YTD","NotPTM","Fri",11075]
["East Coast","Bonders. P","Beverages","Sasquatch Ale",42531,87,247.5,2016,6,"Jun","YTD","NotPTM","Fri",21532.5]
["West Coast","Numkin. M","Grains/Cereals","Singaporean Hokkien Fried Mee",42531,75,63,2016,6,"Jun","YTD","NotPTM","Fri",4725]
["East Coast","Bonders. P","Meat/Poultry","Alice Mutton",42532,83,175.5,2016,6,"Jun","YTD","NotPTM","Sat",14566.5]
["East Coast","Bonders. P","Meat/Poultry","Alice Mutton",42532,7,63,2016,6,"Jun","YTD","NotPTM","Sat",441]
["West Coast","Numkin. M","Beverages","Guaraná Fantástica",42532,88,20,2016,6,"Jun","YTD","NotPTM","Sat",1760]
["South Coast","Hannis. H","Confections","Pavlova",42533,8,78.5,2016,6,"Jun","YTD","NotPTM","Sun",628]
["South Coast","Grooner. T","Dairy Products","Queso Cabrales",42533,37,26.5,2016,6,"Jun","YTD","NotPTM","Sun",980.5]
["North Coast","Dinnel. M","Dairy Products","Geitost",42535,50,11,2016,6,"Jun","YTD","NotPTM","Tue",550]
["West Coast","Numkin. M","Dairy Products","Mozzarella di Giovanni",42535,88,156.5,2016,6,"Jun","YTD","NotPTM","Tue",13772]
["South Coast","Lumford. T","Dairy Products","Queso Manchego La Pastora",42535,20,27,2016,6,"Jun","YTD","NotPTM","Tue",540]
["South Coast","Moodley. L","Beverages","Rhönbräu Klosterbier",42535,200,221.5,2016,6,"Jun","YTD","NotPTM","Tue",44300]
["South Coast","Lumford. T","Seafood","Röd Kaviar",42535,88,67.5,2016,6,"Jun","YTD","NotPTM","Tue",5940]
["West Coast","Pursly. U","Dairy Products","Geitost",42536,5,21.5,2016,6,"Jun","YTD","NotPTM","Wed",107.5]
["South Coast","Ilknis. K","Beverages","Outback Lager",42536,35,67.5,2016,6,"Jun","YTD","NotPTM","Wed",2362.5]
["West Coast","Pursly. U","Beverages","Outback Lager",42536,18,67.5,2016,6,"Jun","YTD","NotPTM","Wed",1215]
["South Coast","Grooner. T","Confections","Tarte au sucre",42536,50,128,2016,6,"Jun","YTD","NotPTM","Wed",6400]
["East Coast","Perks. M","Beverages","Côte de Blaye",42537,125,948.5,2016,6,"Jun","YTD","NotPTM","Thu",118562.5]
["East Coast","Anderson. P","Condiments","Original Frankfurter grüne Soße",42537,87,45,2016,6,"Jun","YTD","NotPTM","Thu",3915]
["North Coast","Connely. K","Meat/Poultry","Pâté chinois",42537,100,180,2016,6,"Jun","YTD","NotPTM","Thu",18000]
["South Coast","Grooner. T","Grains/Cereals","Ravioli Angelo",42537,150,68,{"$f":"YEAR(E2605)","v":2016},{"$f":"MONTH(E2605)","v":6},{"$f":"TEXT(E2605,\"mmm\")","v":"Jun"},{"$f":"IF(I2605<MONTH(TODAY()),\"YTD\",\"Not YTD\")","v":"YTD"},{"$f":"IF(AND(E2605>=EarliestDate,E2605<=MostRecentDate),\"Past12Months\",\"NotPTM\")","v":"NotPTM"},{"$f":"TEXT(E2605,\"ddd\")","v":"Thu"},10200]
["West Coast","Rooney. Y","Confections","Scottish Longbreads",42537,90,45,2016,6,"Jun","YTD","NotPTM","Thu",4050]
["South Coast","Ilknis. K","Beverages","Chang",42538,75,112,2016,6,"Jun","YTD","NotPTM","Fri",8400]
["North Coast","Dinnel. M","Condiments","Chef Anton's Gumbo Mix",42538,12,42.5,2016,6,"Jun","YTD","NotPTM","Fri",510]
["North Coast","Atterson. P","Grains/Cereals","Gnocchi di nonna Alice",42538,37,116.5,2016,6,"Jun","YTD","NotPTM","Fri",4310.5]
["West Coast","Pursly. U","Confections","Pavlova",42538,25,78.5,2016,6,"Jun","YTD","NotPTM","Fri",1962.5]
["West Coast","Numkin. M","Grains/Cereals","Singaporean Hokkien Fried Mee",42538,70,63,2016,6,"Jun","YTD","NotPTM","Fri",4410]
["West Coast","Numkin. M","Grains/Cereals","Singaporean Hokkien Fried Mee",42538,25,81,2016,6,"Jun","YTD","NotPTM","Fri",2025]
["South Coast","Jarison. P","Meat/Poultry","Tourtière",42538,75,85.5,2016,6,"Jun","YTD","NotPTM","Fri",6412.5]
["East Coast","Bonders. P","Confections","Chocolade",42539,75,78.5,2016,6,"Jun","YTD","NotPTM","Sat",5887.5]
["South Coast","Ilknis. K","Seafood","Boston Crab Meat",42541,100,82.5,2016,6,"Jun","YTD","NotPTM","Mon",8250]
["North Coast","Oxford. D","Dairy Products","Camembert Pierrot",42541,100,122,2016,6,"Jun","YTD","NotPTM","Mon",12200]
["East Coast","Anderson. P","Condiments","Gula Malacca",42541,250,69.5,2016,6,"Jun","YTD","NotPTM","Mon",17375]
["West Coast","Pursly. U","Produce","Rössle Sauerkraut",42541,75,163.5,2016,6,"Jun","YTD","NotPTM","Mon",12262.5]
["South Coast","Hannis. H","Confections","Zaanse koeken",42541,25,66,2016,6,"Jun","YTD","NotPTM","Mon",1650]
["East Coast","Newson. L","Seafood","Boston Crab Meat",42542,50,36,2016,6,"Jun","YTD","NotPTM","Tue",1800]
["East Coast","Johnson. A","Confections","Chocolade",42542,125,117.5,2016,6,"Jun","YTD","NotPTM","Tue",14687.5]
["East Coast","Anderson. P","Dairy Products","Gudbrandsdalsost",42542,125,85.5,2016,6,"Jun","YTD","NotPTM","Tue",10687.5]
["West Coast","Stanly. N","Seafood","Konbu",42542,5,21.5,2016,6,"Jun","YTD","NotPTM","Tue",107.5]
["West Coast","Numkin. M","Meat/Poultry","Perth Pasties",42542,122,948.5,2016,6,"Jun","YTD","NotPTM","Tue",115717]
["South Coast","Hannis. H","Dairy Products","Raclette Courdavault",42542,50,247.5,2016,6,"Jun","YTD","NotPTM","Tue",12375]
["North Coast","Connely. K","Produce","Tofu",42542,13,104.5,2016,6,"Jun","YTD","NotPTM","Tue",1358.5]
["South Coast","Ilknis. K","Condiments","Gula Malacca",42543,300,43,2016,6,"Jun","YTD","NotPTM","Wed",12900]
["East Coast","Peters. K","Confections","Gumbär Gummibärchen",42543,75,140.5,2016,6,"Jun","YTD","NotPTM","Wed",{"$f":"F2628*G2628","v":10537.5}]
["East Coast","Peters. K","Seafood","Ikura",42543,67,175.5,2016,6,"Jun","YTD","NotPTM","Wed",11758.5]
["East Coast","Perks. M","Dairy Products","Mozzarella di Giovanni",42543,70,171,2016,6,"Jun","YTD","NotPTM","Wed",11970]
["East Coast","Lavin. T","Beverages","Chartreuse verte",42544,25,81,2016,6,"Jun","YTD","NotPTM","Thu",2025]
["South Coast","Jarison. P","Dairy Products","Geitost",42544,75,11,2016,6,"Jun","YTD","NotPTM","Thu",825]
["North Coast","Dinnel. M","Dairy Products","Gorgonzola Telino",42544,50,56,2016,6,"Jun","YTD","NotPTM","Thu",2800]
["East Coast","Bonders. P","Dairy Products","Gorgonzola Telino",42544,75,136.5,2016,6,"Jun","YTD","NotPTM","Thu",10237.5]
["South Coast","Grooner. T","Seafood","Jack's New England Clam Chowder",42544,50,43,2016,6,"Jun","YTD","NotPTM","Thu",2150]
["East Coast","Newson. L","Dairy Products","Queso Manchego La Pastora",42544,250,171,2016,6,"Jun","YTD","NotPTM","Thu",42750]
["South Coast","Ilknis. K","Meat/Poultry","Alice Mutton",42545,25,156.5,2016,6,"Jun","YTD","NotPTM","Fri",3912.5]
["North Coast","Oxford. D","Beverages","Chai",42545,17,247.5,2016,6,"Jun","YTD","NotPTM","Fri",4207.5]
["West Coast","Numkin. M","Seafood","Jack's New England Clam Chowder",42545,25,43,2016,6,"Jun","YTD","NotPTM","Fri",1075]
["South Coast","Ilknis. K","Produce","Manjimup Dried Apples",42545,8,190.5,2016,6,"Jun","YTD","NotPTM","Fri",1524]
["East Coast","Lavin. T","Grains/Cereals","Singaporean Hokkien Fried Mee",42545,100,63,2016,6,"Jun","YTD","NotPTM","Fri",6300]
["West Coast","Rooney. Y","Beverages","Steeleye Stout",42545,50,81,2016,6,"Jun","YTD","NotPTM","Fri",4050]
["North Coast","Edford. O","Beverages","Chai",42546,15,81,2016,6,"Jun","YTD","NotPTM","Sat",1215]
["East Coast","Newson. L","Beverages","Guaraná Fantástica",42546,13,20,2016,6,"Jun","YTD","NotPTM","Sat",260]
["South Coast","Lumford. T","Beverages","Sasquatch Ale",42547,25,63,2016,6,"Jun","YTD","NotPTM","Sun",1575]
["South Coast","Jarison. P","Confections","Tarte au sucre",42547,5,221.5,2016,6,"Jun","YTD","NotPTM","Sun",1107.5]
["West Coast","Numkin. M","Meat/Poultry","Tourtière",42547,25,129.5,2016,6,"Jun","YTD","NotPTM","Sun",3237.5]
["South Coast","Moodley. L","Confections","Zaanse koeken",42547,52,281,2016,6,"Jun","YTD","NotPTM","Sun",14612]
["West Coast","Toonly. S","Seafood","Inlagd Sill",42548,50,85.5,2016,6,"Jun","YTD","NotPTM","Mon",4275]
["South Coast","Grooner. T","Beverages","Lakkalikööri",42548,10,81,2016,6,"Jun","YTD","NotPTM","Mon",810]
["West Coast","Rooney. Y","Produce","Manjimup Dried Apples",42548,120,238.5,2016,6,"Jun","YTD","NotPTM","Mon",28620]
["East Coast","Peters. K","Confections","Pavlova",42548,20,96.5,2016,6,"Jun","YTD","NotPTM","Mon",1930]
["South Coast","Moodley. L","Confections","Tarte au sucre",42548,125,56,2016,6,"Jun","YTD","NotPTM","Mon",7000]
["East Coast","Bonders. P","Meat/Poultry","Pâté chinois",42550,60,41,{"$f":"YEAR(E2654)","v":2016},{"$f":"MONTH(E2654)","v":6},{"$f":"TEXT(E2654,\"mmm\")","v":"Jun"},{"$f":"IF(I2654<MONTH(TODAY()),\"YTD\",\"Not YTD\")","v":"YTD"},{"$f":"IF(AND(E2654>=EarliestDate,E2654<=MostRecentDate),\"Past12Months\",\"NotPTM\")","v":"NotPTM"},{"$f":"TEXT(E2654,\"ddd\")","v":"Wed"},2460]
["East Coast","Newson. L","Beverages","Rhönbräu Klosterbier",42550,75,34.5,2016,6,"Jun","YTD","NotPTM","Wed",2587.5]
["West Coast","Numkin. M","Confections","Sir Rodney's Scones",42550,20,45,2016,6,"Jun","YTD","NotPTM","Wed",900]
["East Coast","Anderson. P","Beverages","Steeleye Stout",42550,8,81,2016,6,"Jun","YTD","NotPTM","Wed",648]
["North Coast","Oxford. D","Seafood","Boston Crab Meat",42551,63,82.5,2016,6,"Jun","YTD","NotPTM","Thu",5197.5]
["East Coast","Lavin. T","Condiments","Original Frankfurter grüne Soße",42551,87,41,2016,6,"Jun","YTD","NotPTM","Thu",3567]
["South Coast","Hannis. H","Confections","Sir Rodney's Scones",42551,60,27.5,2016,6,"Jun","YTD","NotPTM","Thu",1650]
["West Coast","Rooney. Y","Condiments","Sirop d'érable",42551,10,31.5,2016,6,"Jun","YTD","NotPTM","Thu",315]
["East Coast","Lavin. T","Confections","Teatime Chocolate Biscuits",42551,60,41,2016,6,"Jun","YTD","NotPTM","Thu",2460]
["North Coast","Atterson. P","Condiments","Louisiana Fiery Hot Pepper Sauce",42552,5,94.5,2016,7,"Jul","YTD","NotPTM","Fri",472.5]

{"sheet":"Drivers","index":3,"n_rows":20,"n_cols":13,"rows_kept":20,"cut":false,"hidden":false,"merged":[]}
[]
[null,"YTD Dates Defiition",null,null,null,null,null,null,null,null,null,"Top Views","Top 5 Products"]
[null,"For this dashboard we shall assume days from 1st January",null,null,null,null,null,null,null,"Top Views"]
[null,"to the end of the most recent month",null,null,null,null,null,null,null,"Top 5 Products"]
[null,"e.g. for year 2016 we have:",null,null,null,null,null,null,null,"Bottom 5 Products"]
[null,"Start Date",42370]
[null,"End Date",{"$f":"EOMONTH(TODAY(),-1)","v":43008}]
[null,"Or equivalently, check if the month number is less than the",null,null,null,null,null,null,null,"Top Metrics Dynamic Title"]
[null,"current month"]
[null,null,null,null,null,null,null,null,null,"Text","Formula"]
[null,"Past 12 months defined",null,null,null,null,null,null,null,{"$f":"\"YTD Revenue: \"&selCateg&\" - \"&selYR","v":"YTD Revenue: Condiments - 2015"},"=\"YTD Revenue: \"&selCateg&\" - \"&selYR"]
[null,"This is counting dates from the end of last month, count backwards",null,null,null,null,null,null,null,{"$f":"CONCATENATE(\"YTD Revenue: \",selCateg,\" - \",selYR)","v":"YTD Revenue: Condiments - 2015"},"=CONCATENATE(\"YTD Revenue: \",selCateg,\" - \",selYR)"]
[null,"dates that fall within the last 12 months"]
[null,"That is,"]
[null,"Most recent date",{"$f":"EOMONTH(TODAY(),-1)","v":43008},"30/06/2016",null,null,null,null,null,"Dynamic Chart Titles"]
[null,"Earliest Date",{"$f":"EOMONTH(C15,-12)+1","v":42644},"01/07/2015",null,null,null,null,null,"Text","Formula"]
[null,null,null,null,null,null,null,null,null,{"$f":"\"YTD Monthly Revenue for \"&selLocation","v":"YTD Monthly Revenue for South Coast"},"=\"YTD Revenue for \"&selLocation"]
[null,null,null,null,null,null,null,null,null,{"$f":"\"Product Revenue Share (in $ '000)\"&\" :- \"&selLocation&\", \"&selCateg&\" for \"&selYR","v":"Product Revenue Share (in $ '000) :- South Coast, Condiments for 2015"},"=\"Product Revenue Share (in $ '000)\"&\" :- \"&selLocation&\", \"&selCateg&\" for \"&selYR"]
[null,null,null,null,null,null,null,null,null,{"$f":"\"Sales Agents Performance in \"&selLocation&\" location in \"&selYR","v":"Sales Agents Performance in South Coast location in 2015"},"=\"Sales Agents Performance in \"&selLocation&\" location in \"&selYR"]
[null,null,null,null,null,null,null,null,null,{"$f":"\"Location performance: \"&selCateg&\" \"&selYR","v":"Location performance: Condiments 2015"},"=\"Location performance: \"&selCateg&\" \"&selYR"]