{"text_format":"1","workbook":"xlsx","n_sheets":5,"sheets":["4R","4G","4Y","COMBINED","Grades"],"not_rendered":{"charts":0,"images":0,"macros":1,"external_links":0,"defined_names":1,"comments":0,"pivot_tables":0},"unopened":[],"bounds":{"document_bytes":16777216,"sheet_cells":100000,"rows_first":2000,"rows_last":500,"rows_between":2000,"halvings":0,"cell_chars":16384,"cell_head_chars":4096},"cells_cut":0,"cells_raw":0,"read":"whole","date_system":"1900"}

{"sheet":"4R","index":0,"n_rows":18,"n_cols":17,"rows_kept":18,"cut":false,"hidden":false,"merged":[[4,3,4,4]]}
[null,"TERM 1 2016"]
[null,"SPRINGS VALLEY SENIOR SCH."]
[null,"GRADE 4R: MS CELESTINE"]
[null,null,null,"SUBJECTS"]
["#","Student Name","GENDER","MATHS",null,"GRAM","COMP","%",null,"SCIE",null,"SOCIAL",null,"MUSIC","%",null,"TOTAL"]
[1,"James Kirk","B",96,{"$f":"VLOOKUP(D6,GradingTable,2,TRUE)","v":"A"},54,30,{"$f":"SUM(F6:G6)","v":84},{"$f":"VLOOKUP(H6,GradingTable,2,TRUE)","v":"A"},89,{"$f":"VLOOKUP(J6,GradingTable,2,TRUE)","v":"A"},61.666666666666671,{"$f":"VLOOKUP(L6,GradingTable,2,TRUE)","v":"B-"},30,{"$f":"N6/30*100","v":100},{"$f":"VLOOKUP(O6,GradingTable,2,TRUE)","v":"A"},{"$f":"D6+H6+J6+L6+O6","v":430.66666666666669}]
[2,"Lela Donovan","G",86,"A",34,35,69,"B",59,"C+",78.333333333333329,"A-",26,86.666666666666671,"A",379]
[3,"Richard Agassi","B",77,"A-",52,31,83,"A",66,"B",81.666666666666671,"A",28,93.333333333333329,"A",401]
[4,"Chewbacca","G",53,"C",47,31,78,"A-",88,"A",80,"A",26,86.666666666666671,"A",385.66666666666669]
[5,"Luke Skywalker","B",98,"A",40,32,72,"B+",66,"B",75,"A-",24,80,"A",391]
[6,"Joseph Cairn","B",74,"B+",34,33,67,"B",84,"A",70,"B+",25,83.333333333333343,"A",378.33333333333337]
[7,"David Love","B",92,"A",51,35,86,"A",84,"A",76.666666666666671,"A-",27,90,"A",428.66666666666669]
[8,"Hansolo","G",82,"A",38,30,68,"B",67,"B",70,"B+",29,96.666666666666671,"A",383.66666666666669]
[9,"Harold Pawlan","B",84,"A",41,34,75,"A-",91,"A",75,"A-",30,100,"A",425]
[10,"Carl Lewis","B",78,"A-",44,36,80,"A",66,"B",75,"A-",30,100,"A",399]
[11,"BillyRay","B",61,"B-",40,32,72,"B+",86,"A",81.666666666666671,"A",29,96.666666666666671,"A",397.33333333333337]
[12,"Andy Roddick","G",90,"A",32,28,60,"B-",93,"A",61.666666666666671,"B-",26,86.666666666666671,"A",391.33333333333337]
[13,"Shui Tom","G",57,"C+",50,29,79,"A-",61,"B-",61.666666666666671,"B-",29,96.666666666666671,"A",355.33333333333337]

{"sheet":"4G","index":1,"n_rows":16,"n_cols":17,"rows_kept":16,"cut":false,"hidden":false,"merged":[[4,3,4,4]]}
[null,"TERM 1 2016"]
[null,"SPRINGS VALLEY SENIOR SCH."]
[null,"GRADE 4G: MR KILUNDA"]
[null,null,null,"SUBJECTS"]
["#","Student Name","GENDER","MATHS",null,"GRAM","COMP","%",null,"SCIE",null,"SOCIAL",null,"MUSIC","%",null,"TOTAL"]
[1,"Damon Hill","B",86,{"$f":"VLOOKUP(D6,GradingTable,2,TRUE)","v":"A"},43,34,{"$f":"SUM(F6:G6)","v":77},{"$f":"VLOOKUP(H6,GradingTable,2,TRUE)","v":"A-"},88,{"$f":"VLOOKUP(J6,GradingTable,2,TRUE)","v":"A"},63,{"$f":"VLOOKUP(L6,GradingTable,2,TRUE)","v":"B-"},27,{"$f":"N6/30*100","v":90},{"$f":"VLOOKUP(O6,GradingTable,2,TRUE)","v":"A"},{"$f":"D6+H6+J6+L6+O6","v":404}]
[2,"Michelle Wong","G",82,"A",43,29,72,"B+",88,"A",87,"A",21,70,"B+",399]
[3,"Bill Wanton","B",91,"A",41,30,71,"B+",79,"A-",87,"A",22,73.333333333333329,"B+",401.33333333333331]
[4,"Terri Spencer","G",92,"A",38,31,69,"B",81,"A",84,"A",26,86.666666666666671,"A",412.66666666666669]
[5,"Rhino Augustus","B",90,"A",47,30,77,"A-",85,"A",94,"A",23,76.666666666666671,"A-",422.66666666666669]
[6,"Neil Seth","G",85,"A",48,31,79,"A-",91,"A",67,"B",24,80,"A",402]
[7,"Steffi Graf","G",95,"A",43,30,73,"B+",88,"A",84,"A",27,90,"A",430]
[8,"Joseph Airdo","B",93,"A",29,36,65,"B",81,"A",66,"B",25,83.333333333333343,"A",388.33333333333337]
[9,"Rozario Diego","G",79,"A-",37,32,69,"B",83,"A",85,"A",20,66.666666666666657,"B",382.66666666666663]
[10,"Mary Zewe","G",95,"A",48,35,83,"A",87,"A",88,"A",21,70,"B+",423]
[11,"Helen Magadalene","G",93,"A",42,29,71,"B+",88,"A",88,"A",23,76.666666666666671,"A-",416.66666666666669]

{"sheet":"4Y","index":2,"n_rows":22,"n_cols":17,"rows_kept":22,"cut":false,"hidden":false,"merged":[[4,3,4,4]]}
[null,"TERM 1 2016"]
[null,"SPRINGS VALLEY SENIOR SCH."]
[null,"GRADE 4Y: MR YASSIN"]
[null,null,null,"SUBJECTS"]
["#","Student Name","GENDER","MATHS",null,"GRAM","COMP","%",null,"SCIE",null,"SOCIAL",null,"MUSIC","%",null,"TOTAL"]
[1,"Paul Adams","B",57,{"$f":"VLOOKUP(D6,GradingTable,2,TRUE)","v":"C+"},52,23,{"$f":"SUM(F6:G6)","v":75},{"$f":"VLOOKUP(H6,GradingTable,2,TRUE)","v":"A-"},77,{"$f":"VLOOKUP(J6,GradingTable,2,TRUE)","v":"A-"},63,{"$f":"VLOOKUP(L6,GradingTable,2,TRUE)","v":"B-"},25,{"$f":"N6/30*100","v":83.333333333333343},{"$f":"VLOOKUP(O6,GradingTable,2,TRUE)","v":"A"},{"$f":"D6+H6+J6+L6+O6","v":355.33333333333337}]
[2,"Angelus Mathew","G",57,"C+",32,31,63,"B-",62,"B-",87,"A",25,83.333333333333343,"A",352.33333333333337]
[3,"David Boon","B",62,"B-",50,32,82,"A",70,"B+",84,"A",25,83.333333333333343,"A",381.33333333333337]
[4,"Victor Price","B",77,"A-",50,30,80,"A",76,"A-",69,"B",26,86.666666666666671,"A",388.66666666666669]
[5,"Michael Angelo","B",73,"B+",42,24,66,"B",64,"B-",86,"A",24,80,"A",369]
[6,"Munaf Patel","B",62,"B-",51,30,81,"A",77,"A-",84,"A",27,90,"A",394]
[7,"Grace Kelly","G",62,"B-",48,31,79,"A-",66,"B",75,"A-",27,90,"A",372]
[8,"John Elliot","B",73,"B+",38,26,64,"B-",72,"B+",62,"B-",28,93.333333333333329,"A",364.33333333333331]
[9,"Stephanie Ulpright","B",73,"B+",39,24,63,"B-",69,"B",76,"A-",29,96.666666666666671,"A",377.66666666666669]
[10,"Venu Karthik","G",52,"C",45,29,74,"B+",62,"B-",73,"B+",26,86.666666666666671,"A",347.66666666666669]
[11,"Steve Waugh","B",71,"B+",48,23,71,"B+",62,"B-",68,"B",29,96.666666666666671,"A",368.66666666666669]
[12,"Florence Joy","G",61,{"$f":"VLOOKUP(D17,GradingTable,2,TRUE)","v":"B-"},48,28,76,{"$f":"VLOOKUP(H17,GradingTable,2,TRUE)","v":"A-"},77,{"$f":"VLOOKUP(J17,GradingTable,2,TRUE)","v":"A-"},70,{"$f":"VLOOKUP(L17,GradingTable,2,TRUE)","v":"B+"},24,80,{"$f":"VLOOKUP(O17,GradingTable,2,TRUE)","v":"A"},364]
[13,"Thomas Seio","B",54,"C",48,31,79,"A-",60,"B-",72,"B+",28,93.333333333333329,"A",358.33333333333331]
[14,"Peter Brian","B",78,"A-",45,30,75,"A-",63,"B-",80,"A",27,90,"A",386]
[15,"Joseph Aaron","B",57,"C+",52,23,75,"A-",66,"B",75,"A-",26,86.666666666666671,"A",359.66666666666669]
[16,"Santa Cruz Clara","G",74,"B+",48,32,80,"A",71,"B+",76,"A-",27,90,"A",391]
[17,"Sheri Gordon","G",59,"C+",34,29,63,"B-",62,"B-",85,"A",26,86.666666666666671,"A",355.66666666666669]

{"sheet":"COMBINED","index":3,"n_rows":0,"n_cols":0,"rows_kept":0,"cut":false,"hidden":false,"merged":[]}

{"sheet":"Grades","index":4,"n_rows":12,"n_cols":3,"rows_kept":12,"cut":false,"hidden":false,"merged":[]}
[]
[]
[]
[null,"Score Limit","Grade"]
[null,0,"D+"]
[null,49.5,"C"]
[null,54.5,"C+"]
[null,59.5,"B-"]
[null,64.5,"B"]
[null,69.5,"B+"]
[null,74.5,"A-"]
[null,79.5,"A"]